program: Orca
programVersion: 5.0.2
elementType: Cl Cl F F F F F F F F O O O N N C C C C C C C C C C C C C C C C C H H H H H H H H
charge: 0
multiplicity: 1
keywords: wb97x-d3
keywords: def2-TZVPP
keywords: def2/J RIJCOSX
keywords: DEFGRID2
keywords: scfconv7
keywords: smallprint printgap noloewdin
keywords: NOSOSCF
formula: C17H8Cl2F8N2O3
InChI: InChI=1/C17H8Cl2F8N2O3/c18-6-5-11(32-17(26,27)14(22)16(23,24)25)7(19)4-10(6)28-15(31)29-13(30)12-8(20)2-1-3-9(12)21/h1-5,14,28-29H
40 atoms
Cl 2.578309 -1.816638 -2.074554
Cl -0.724413 2.534146 0.849109
F  6.281179 1.342411 -0.724849
F  4.340381 1.101986 1.20983
F  4.026109 -0.963265 0.683973
F  8.108062 -0.340007 0.175861
F  6.644917 -1.703288 0.973084
F  6.885019 0.255447 1.840872
F  -6.062602 0.45152 2.564731
F  -6.352356 -0.411987 -2.010813
O  3.652425 0.617155 -0.844922
O  -2.243619 -2.078614 -0.982873
O  -4.168307 1.295279 0.446082
N  -1.861647 0.084636 -0.326902
N  -3.993537 -0.854076 -0.289554
C  5.87018 0.105565 -0.318995
C  4.431533 0.222198 0.195295
C  2.293591 0.479731 -0.703024
C  -0.482801 0.177489 -0.479144
C  6.885906 -0.422371 0.698951
C  1.657543 -0.626097 -1.245096
C  1.543461 1.448827 -0.066025
C  0.173763 1.299732 0.041731
C  0.287365 -0.777107 -1.142467
C  -2.623174 -1.011778 -0.567234
C  -6.15395 0.01489 0.274876
C  -4.680771 0.240386 0.154497
C  -6.796958 0.164093 1.496297
C  -6.946156 -0.28958 -0.82247
C  -8.158903 -0.008756 1.637404
C  -8.311966 -0.459595 -0.73063
C  -8.908072 -0.319487 0.512854
H  5.866053 -0.575859 -1.17619
H  2.023029 2.328255 0.339755
H  -0.177688 -1.650481 -1.567734
H  -2.345856 0.89247 0.05721
H  -4.512732 -1.699257 -0.474882
H  -8.618916 0.098627 2.609521
H  -8.890473 -0.691591 -1.613652
H  -9.976451 -0.454711 0.6076
totalener: -2707.25991396 hartree
nucrepener: 3619.34758062 hartree
electener: -6326.60749459 hartree
twoeener: 4610.88860428 hartree
kineticenergy: 2699.71947354 hartree
xcener: -195.746766981524 hartree
chargesum: 0.0000000
charge: -0.049084 -0.055716 -0.185029 -0.174148 -0.166862 -0.155777 -0.155248 -0.150246 -0.176173 -0.187928 -0.301641 -0.399526 -0.358342 -0.200020 -0.176643 0.131197 0.425734 0.147964 0.149561 0.449381 0.053395 -0.095025 -0.027594 -0.154284 0.399229 -0.154177 0.372724 0.295690 0.275773 -0.223842 -0.224005 -0.042419 0.092269 0.124181 0.144991 0.178336 0.169512 0.131861 0.133324 0.138605
qa: -0.0491 -0.0557 -0.1850 -0.1741 -0.1669 -0.1558 -0.1552 -0.1502 -0.1762 -0.1879 -0.3016 -0.3995 -0.3583 -0.2000 -0.1766 0.1312 0.4257 0.1480 0.1496 0.4494 0.0534 -0.0950 -0.0276 -0.1543 0.3992 -0.1542 0.3727 0.2957 0.2758 -0.2238 -0.2240 -0.0424 0.0923 0.1242 0.1450 0.1783 0.1695 0.1319 0.1333 0.1386
va: 1.2668 1.2717 1.1042 1.1414 1.1398 1.1584 1.1577 1.1692 1.1347 1.1103 2.1148 2.1067 2.1531 3.2333 3.1986 4.0145 4.3795 3.9025 3.8810 4.4873 4.0545 4.0700 4.0171 4.0215 4.3100 3.5758 4.0939 4.0089 3.9832 3.9945 3.9951 3.8481 1.0215 1.0220 1.0464 1.0891 1.0262 1.0088 1.0082 0.9956
dispcorr: -0.020323694 hartree
energy: -2707.280237657129
dipole: -49.63088 46.71246 -2.91842 -2.32660 1.99306 -0.33354 -3.88186 3.71055 -0.17130
magnitude: 2.94241 au
magnitude: 7.47900 debye
