program: Orca
programVersion: 5.0.2
elementType: Cl Cl F F F F F F F F O O O N N C C C C C C C C C C C C C C C C C H H H H H H H H
charge: 0
multiplicity: 1
keywords: wb97x-d3
keywords: def2-TZVPP
keywords: def2/J RIJCOSX
keywords: DEFGRID2
keywords: scfconv7
keywords: smallprint printgap noloewdin
keywords: NOSOSCF
formula: C17H8Cl2F8N2O3
InChI: InChI=1/C17H8Cl2F8N2O3/c18-6-5-11(32-17(26,27)14(22)16(23,24)25)7(19)4-10(6)28-15(31)29-13(30)12-8(20)2-1-3-9(12)21/h1-5,14,28-29H
40 atoms
Cl 2.590821 -2.540507 -0.953767
Cl -0.743239 1.923342 1.75475
F  5.887492 -1.440505 -0.413487
F  4.079528 0.452087 -1.197459
F  4.449659 1.619383 0.574878
F  7.160442 1.753499 0.271282
F  6.764609 0.947044 -1.689833
F  8.142432 -0.048875 -0.376139
F  -6.392618 0.795646 2.187406
F  -6.11598 -0.425928 -2.31229
O  3.638527 -0.438904 0.794778
O  -2.366638 -2.332482 -0.661979
O  -4.132164 1.250183 0.404656
N  -1.876075 -0.224995 0.089472
N  -4.072228 -0.922778 -0.271754
C  5.882477 -0.221436 0.199166
C  4.468934 0.360993 0.07968
C  2.286281 -0.348688 0.569657
C  -0.49348 -0.304493 0.222757
C  6.995993 0.627856 -0.42217
C  1.657829 -1.308891 -0.208553
C  1.532227 0.64558 1.162688
C  0.161379 0.667437 0.98869
C  0.284649 -1.293758 -0.377096
C  -2.698188 -1.229228 -0.305681
C  -6.193826 0.18635 -0.057997
C  -4.702974 0.24637 0.046504
C  -6.987584 0.513846 1.035015
C  -6.851466 -0.118865 -1.241472
C  -8.365875 0.522643 0.97109
C  -8.226477 -0.10889 -1.354326
C  -8.976045 0.212899 -0.234107
H  6.112161 -0.348134 1.262469
H  2.00582 1.393215 1.782737
H  -0.177057 -2.05799 -0.979719
H  -2.328412 0.634716 0.389904
H  -4.637625 -1.712122 -0.545996
H  -8.944513 0.768935 1.850146
H  -8.694272 -0.344946 -2.299542
H  -10.054926 0.221528 -0.301037
totalener: -2707.25929895 hartree
nucrepener: 3617.79728999 hartree
electener: -6325.05658894 hartree
twoeener: 4609.56603981 hartree
kineticenergy: 2699.70664311 hartree
xcener: -195.744015042688 hartree
chargesum: -0.0000000
charge: -0.033087 -0.056844 -0.180075 -0.161516 -0.180910 -0.156953 -0.149646 -0.155637 -0.175453 -0.188751 -0.304762 -0.397202 -0.360870 -0.205615 -0.177708 0.112480 0.442122 0.132132 0.161241 0.452374 0.048490 -0.086775 -0.031942 -0.151737 0.397271 -0.155247 0.375511 0.291304 0.277925 -0.220114 -0.224164 -0.043644 0.095227 0.121973 0.137554 0.179430 0.169394 0.131859 0.133357 0.139005
qa: -0.0331 -0.0568 -0.1801 -0.1615 -0.1809 -0.1570 -0.1496 -0.1556 -0.1755 -0.1888 -0.3048 -0.3972 -0.3609 -0.2056 -0.1777 0.1125 0.4421 0.1321 0.1612 0.4524 0.0485 -0.0868 -0.0319 -0.1517 0.3973 -0.1552 0.3755 0.2913 0.2779 -0.2201 -0.2242 -0.0436 0.0952 0.1220 0.1376 0.1794 0.1694 0.1319 0.1334 0.1390
va: 1.2859 1.2711 1.1094 1.1493 1.1278 1.1557 1.1703 1.1586 1.1355 1.1092 2.1156 2.1084 2.1502 3.2265 3.2013 4.0216 4.3481 3.9030 3.8451 4.4828 4.0936 4.0644 4.0341 4.0368 4.3141 3.5754 4.0953 4.0084 3.9808 3.9909 3.9948 3.8497 1.0171 1.0248 1.0471 1.0858 1.0267 1.0087 1.0083 0.9955
dispcorr: -0.020314712 hartree
energy: -2707.279613662308
dipole: -49.82645 47.06333 -2.76312 -3.96862 4.01283 0.04421 2.71976 -2.18877 0.53099
magnitude: 2.81403 au
magnitude: 7.15269 debye
