program: Orca
programVersion: 5.0.2
elementType: Cl Cl F F F F F F O O O N N C C C C C C C C C C C C C C C C H H H H H H H H
charge: 0
multiplicity: 1
keywords: wb97x-d3
keywords: def2-TZVPP
keywords: def2/J RIJCOSX
keywords: DEFGRID2
keywords: scfconv7
keywords: smallprint printgap noloewdin
keywords: NOSOSCF
formula: C16H8Cl2F6N2O3
InChI: InChI=1/C16H8Cl2F6N2O3/c17-7-4-6(5-8(18)12(7)29-16(23,24)14(21)22)25-15(28)26-13(27)11-9(19)2-1-3-10(11)20/h1-5,14,25-26H
37 atoms
Cl -2.747479 -2.731365 1.003948
Cl -3.25191 1.750718 -1.914428
F  -4.640034 1.32203 0.793634
F  -4.71355 -0.560801 1.819307
F  -6.718022 0.58551 -0.811293
F  -7.156711 0.395954 1.321327
F  5.787959 -0.105838 -2.144679
F  5.498496 -0.074824 2.518046
O  -4.241455 -0.551807 -0.366452
O  1.729671 1.962488 -1.337527
O  3.544891 -1.165471 0.654903
N  1.290997 -0.018793 -0.285331
N  3.462362 0.786963 -0.515085
C  -0.096052 -0.09255 -0.360271
C  -2.879181 -0.401702 -0.349376
C  -0.68701 -1.183228 0.27931
C  -0.900687 0.818647 -1.040199
C  -2.058583 -1.334362 0.274818
C  -2.274623 0.650355 -1.022754
C  -4.959661 0.026306 0.633512
C  5.589825 -0.0870 0.18477
C  2.092017 0.965522 -0.749853
C  4.106029 -0.223929 0.130865
C  -6.443434 -0.127435 0.301307
C  6.386889 -0.060292 -0.950968
C  6.242018 -0.061566 1.411042
C  7.763641 -0.010082 -0.891247
C  7.614148 0.000137 1.521095
C  8.367431 0.021663 0.356392
H  -0.071369 -1.918338 0.782131
H  -0.481709 1.652205 -1.578007
H  1.753828 -0.77664 0.210869
H  4.021503 1.557299 -0.861805
H  -6.72578 -1.171041 0.152273
H  8.349253 -0.001535 -1.800352
H  8.082902 0.031206 2.495243
H  9.445861 0.063921 0.42304
elementType: Cl F O N C H
totalener: -2469.43822719 hartree
nucrepener: 3082.47532402 hartree
electener: -5551.91355121 hartree
oneelecener: -9536.55473772 hartree
twoeener: 3984.64118651 hartree
cpcmener: -0.03302522 hartree
kineticenergy: 2462.56683792 hartree
xcener: -176.978512071679 hartree
chargesum: -0.0000000
charge: -0.052173 -0.053340 -0.177475 -0.180948 -0.193254 -0.194041 -0.205858 -0.201231 -0.313154 -0.482259 -0.441591 -0.167563 -0.151827 0.165398 0.158429 -0.181216 -0.177248 0.038532 0.045210 0.454206 -0.134138 0.423501 0.398772 0.294163 0.312196 0.302460 -0.242324 -0.241055 -0.063479 0.129297 0.141523 0.201424 0.196348 0.120149 0.152947 0.152722 0.166902
qa: -0.0522 -0.0533 -0.1775 -0.1809 -0.1933 -0.1940 -0.2059 -0.2012 -0.3132 -0.4823 -0.4416 -0.1676 -0.1518 0.1654 0.1584 -0.1812 -0.1772 0.0385 0.0452 0.4542 -0.1341 0.4235 0.3988 0.2942 0.3122 0.3025 -0.2423 -0.2411 -0.0635 0.1293 0.1415 0.2014 0.1963 0.1201 0.1529 0.1527 0.1669
va: 1.2578 1.2617 1.1289 1.1249 1.0934 1.0943 1.0892 1.0984 2.1102 2.0295 2.0736 3.2530 3.2194 3.9707 3.8752 4.0421 4.0256 4.0338 4.0261 4.3044 3.5494 4.3112 4.0782 4.1253 3.9325 3.9598 3.9593 3.9615 3.8098 1.0270 1.0501 1.0422 1.0063 0.9857 1.0007 1.0007 0.9848
dispcorr: -0.017973212 hartree
energy: -2469.456200398202
dipole: 42.03009 -38.12310 3.90699 -0.65750 -0.13982 -0.79732 -2.19903 2.24928 0.05026
magnitude: 3.98784 au
magnitude: 10.13628 debye
