program: Orca
programVersion: 5.0.2
elementType: Cl Cl F F F F F F O O O N N C C C C C C C C C C C C C C C C H H H H H H H H
charge: 0
multiplicity: 1
keywords: wb97x-d3
keywords: def2-TZVPP
keywords: def2/J RIJCOSX
keywords: DEFGRID2
keywords: scfconv7
keywords: smallprint printgap noloewdin
keywords: NOSOSCF
formula: C16H8Cl2F6N2O3
InChI: InChI=1/C16H8Cl2F6N2O3/c17-7-4-6(5-8(18)12(7)29-16(23,24)14(21)22)25-15(28)26-13(27)11-9(19)2-1-3-10(11)20/h1-5,14,25-26H
37 atoms
Cl -2.888189 -2.713168 0.116921
Cl -3.176667 2.539437 -0.985597
F  -4.83536 1.287695 1.253291
F  -4.571997 -0.78758 1.738122
F  -6.625786 -1.459135 0.023282
F  -6.918027 0.661328 -0.424243
F  5.82451 -1.807576 -1.567231
F  5.43165 1.378051 1.819489
O  -4.275286 -0.138248 -0.380333
O  1.800587 2.229792 -0.905721
O  3.502775 -1.347443 0.282319
N  1.276375 0.093984 -0.266343
N  3.483245 0.827288 -0.394612
C  -0.116154 0.107581 -0.318423
C  -2.911097 -0.053467 -0.325258
C  -0.756952 -1.108322 -0.086303
C  -0.877791 1.24016 -0.590797
C  -2.135779 -1.184906 -0.095047
C  -2.259269 1.143611 -0.590216
C  -4.98166 0.043199 0.760652
C  5.577683 -0.219049 0.122034
C  2.112483 1.121982 -0.546776
C  4.088984 -0.321623 0.022164
C  -6.467198 -0.210064 0.495567
C  6.39582 -1.018544 -0.664151
C  6.199766 0.611561 1.042571
C  7.771388 -0.994347 -0.560065
C  7.571229 0.664165 1.185396
C  8.348559 -0.147481 0.373753
H  -0.18253 -2.006794 0.098679
H  -0.416181 2.189636 -0.802607
H  1.719758 -0.779322 0.000408
H  4.067529 1.618223 -0.620446
H  -7.045693 -0.094098 1.416452
H  8.373271 -1.626351 -1.197922
H  8.015732 1.322089 1.918844
H  9.424995 -0.11971 0.470251
totalener: -2469.41310039 hartree
nucrepener: 3087.31647150 hartree
electener: -5556.72957189 hartree
oneelecener: -9546.14514045 hartree
twoeener: 3989.41556856 hartree
kineticenergy: 2462.62995097 hartree
xcener: -176.983460345953 hartree
chargesum: -0.0000000
charge: -0.035272 -0.034149 -0.173437 -0.176059 -0.173074 -0.172906 -0.178234 -0.187120 -0.287351 -0.397312 -0.370741 -0.189906 -0.175803 0.167238 0.146555 -0.178145 -0.169632 0.027969 0.041022 0.446330 -0.157074 0.396139 0.375706 0.285641 0.301227 0.277904 -0.225468 -0.224856 -0.041949 0.104216 0.147369 0.178262 0.170334 0.078696 0.131344 0.133737 0.138799
qa: -0.0353 -0.0341 -0.1734 -0.1761 -0.1731 -0.1729 -0.1782 -0.1871 -0.2874 -0.3973 -0.3707 -0.1899 -0.1758 0.1672 0.1466 -0.1781 -0.1696 0.0280 0.0410 0.4463 -0.1571 0.3961 0.3757 0.2856 0.3012 0.2779 -0.2255 -0.2249 -0.0419 0.1042 0.1474 0.1783 0.1703 0.0787 0.1313 0.1337 0.1388
va: 1.2777 1.2781 1.1376 1.1313 1.1220 1.1226 1.1316 1.1116 2.1457 2.1113 2.1415 3.2548 3.2004 3.9659 3.8707 4.0558 4.0287 4.1048 4.0522 4.3092 3.5761 4.3109 4.0903 4.1861 4.0037 3.9899 3.9977 3.9960 3.8470 1.0360 1.0481 1.0682 1.0255 0.9887 1.0089 1.0079 0.9955
dispcorr: -0.018031207 hartree
energy: -2469.431131599468
dipole: 41.49492 -38.59174 2.90318 1.39771 -1.46932 -0.07161 -0.27931 0.81389 0.53458
magnitude: 2.95286 au
magnitude: 7.50558 debye
