program: Orca
programVersion: 5.0.2
elementType: Cl F F F F F F O O O N N C C C C C C C C C C C C C C C C C C C C C H H H H H H H H H H H
charge: 0
multiplicity: 1
keywords: wb97x-d3
keywords: def2-TZVPP
keywords: def2/J RIJCOSX
keywords: DEFGRID2
keywords: scfconv7
keywords: smallprint printgap noloewdin
keywords: NOSOSCF
formula: C21H11ClF6N2O3
InChI: InChI=1/C21H11ClF6N2O3/c22-12-8-10(21(26,27)28)4-7-17(12)33-11-5-6-16(15(25)9-11)29-20(32)30-19(31)18-13(23)2-1-3-14(18)24/h1-9,29-30H
44 atoms
Cl 5.388841 -2.456109 -1.958202
F  -0.758762 0.887393 -1.52144
F  7.695384 1.41396 1.993175
F  8.452048 1.261054 -0.015447
F  7.1030 2.850447 0.513324
F  -6.680489 1.090463 -2.151038
F  -6.352493 0.507845 2.46626
O  3.010728 -1.791797 -0.523558
O  -3.282181 -2.520227 0.692993
O  -4.253076 1.332546 -0.425955
N  -2.362657 -0.519608 0.085774
N  -4.657978 -0.767797 0.359221
C  1.698618 -1.436254 -0.318166
C  4.005569 -0.927071 -0.225942
C  -1.01759 -0.88444 -0.007984
C  6.19404 0.689736 0.34439
C  1.139112 -0.380316 -1.021816
C  0.934353 -2.196324 0.545239
C  -0.201191 -0.12974 -0.848508
C  -0.416356 -1.919933 0.700216
C  5.235273 -1.154362 -0.838679
C  3.877622 0.12715 0.670183
C  6.328846 -0.35809 -0.55378
C  4.966937 0.930398 0.951786
C  7.362422 1.549679 0.70098
C  -6.475573 0.7846 0.153047
C  -3.381543 -1.346423 0.392644
C  -5.02254 0.491192 -0.001207
C  -7.251893 1.124638 -0.945211
C  -7.091076 0.812952 1.395204
C  -8.582059 1.467185 -0.833636
C  -8.415178 1.15958 1.559723
C  -9.153161 1.483925 0.431031
H  1.721861 0.225955 -1.70429
H  1.383541 -3.008779 1.100134
H  -0.988338 -2.5150 1.393261
H  2.932773 0.319342 1.161017
H  7.269979 -0.565001 -1.043808
H  4.845281 1.740462 1.659093
H  -2.62001 0.410966 -0.230417
H  -5.393923 -1.406211 0.637388
H  -9.158613 1.715222 -1.714211
H  -8.857052 1.179888 2.546378
H  -10.19372 1.756345 0.53853
elementType: Cl F O N C H
totalener: -2201.56855161 hartree
nucrepener: 3273.16739371 hartree
electener: -5474.73594532 hartree
oneelecener: -9537.44073250 hartree
twoeener: 4062.70478718 hartree
cpcmener: -0.04106191 hartree
kineticenergy: 2194.49187883 hartree
xcener: -175.413438133403 hartree
chargesum: 0.0000000
charge: -0.072956 -0.217544 -0.184758 -0.181203 -0.185052 -0.204679 -0.208524 -0.320070 -0.513331 -0.460830 -0.189262 -0.152647 0.208201 0.273622 0.070846 -0.073275 -0.162734 -0.207776 0.275341 -0.164694 -0.026752 -0.163216 -0.095943 -0.175722 0.564032 -0.129081 0.436736 0.409226 0.308845 0.312384 -0.248343 -0.243256 -0.066067 0.157531 0.153024 0.155769 0.161601 0.133546 0.155578 0.189046 0.202512 0.154675 0.155139 0.170063
qa: -0.0730 -0.2175 -0.1848 -0.1812 -0.1851 -0.2047 -0.2085 -0.3201 -0.5133 -0.4608 -0.1893 -0.1526 0.2082 0.2736 0.0708 -0.0733 -0.1627 -0.2078 0.2753 -0.1647 -0.0268 -0.1632 -0.0959 -0.1757 0.5640 -0.1291 0.4367 0.4092 0.3088 0.3124 -0.2483 -0.2433 -0.0661 0.1575 0.1530 0.1558 0.1616 0.1335 0.1556 0.1890 0.2025 0.1547 0.1551 0.1701
va: 1.2429 1.0719 1.1074 1.1222 1.1110 1.0936 1.0860 2.0872 1.9930 2.0498 3.2168 3.2146 3.7593 3.8022 3.7817 3.7040 3.9786 4.0636 3.9666 3.9512 3.9466 3.9137 4.0038 4.0612 4.4148 3.5445 4.3037 4.0713 3.9505 3.9286 3.9591 3.9599 3.8066 1.0003 1.0033 1.0185 0.9944 1.0266 1.0057 1.0654 1.0013 1.0002 0.9996 0.9834
dispcorr: -0.020723357 hartree
energy: -2201.589274965210
dipole: -33.96422 30.49539 -3.46883 -4.30015 4.91551 0.61536 5.59276 -4.63047 0.96228
magnitude: 3.65205 au
magnitude: 9.28277 debye
