program: Orca
programVersion: 5.0.2
elementType: Cl F F F F F F O O O N N C C C C C C C C C C C C C C C C C C C C C H H H H H H H H H H H
charge: 0
multiplicity: 1
keywords: wb97x-d3
keywords: def2-TZVPP
keywords: def2/J RIJCOSX
keywords: DEFGRID2
keywords: scfconv7
keywords: smallprint printgap noloewdin
keywords: NOSOSCF
formula: C21H11ClF6N2O3
InChI: InChI=1/C21H11ClF6N2O3/c22-12-8-10(21(26,27)28)4-7-17(12)33-11-5-6-16(15(25)9-11)29-20(32)30-19(31)18-13(23)2-1-3-14(18)24/h1-9,29-30H
44 atoms
Cl 5.310226 -2.385943 1.972662
F  -1.478523 -2.392177 -0.753603
F  7.528447 1.862925 -2.049667
F  7.626666 2.441477 0.014962
F  8.660311 0.680745 -0.654252
F  -6.114773 2.366861 -1.499791
F  -7.19143 -1.44924 0.972353
O  2.980618 -1.659291 0.484299
O  -2.447556 2.024878 1.079871
O  -4.759078 -0.992664 -0.526914
N  -2.344511 -0.098058 0.243432
N  -4.363702 1.03706 0.427994
C  1.698155 -1.177491 0.394009
C  4.032789 -0.882015 0.140804
C  -0.977934 -0.368665 0.318593
C  6.315802 0.565247 -0.505405
C  0.754958 -2.007254 -0.188649
C  1.326365 0.043341 0.930265
C  -0.55364 -1.587765 -0.206736
C  -0.000406 0.445929 0.887449
C  5.242966 -1.145521 0.778789
C  3.977777 0.109733 -0.829138
C  6.381543 -0.431002 0.459809
C  5.113617 0.833271 -1.146388
C  7.531297 1.382083 -0.803068
C  -6.59863 0.457445 -0.244628
C  -2.972928 1.033371 0.611542
C  -5.160081 0.089276 -0.137415
C  -7.035239 1.577434 -0.938991
C  -7.578525 -0.366745 0.295283
C  -8.369954 1.888515 -1.087194
C  -8.924021 -0.092508 0.181572
C  -9.308865 1.043273 -0.515807
H  1.02783 -2.966075 -0.609989
H  2.056269 0.691635 1.397509
H  -0.25915 1.396952 1.321412
H  3.051808 0.320076 -1.347426
H  7.30554 -0.657502 0.974836
H  5.041146 1.601396 -1.904103
H  -2.939402 -0.828075 -0.139473
H  -4.803083 1.887012 0.763806
H  -8.66747 2.768145 -1.641141
H  -9.654498 -0.751389 0.630262
H  -10.360496 1.271424 -0.617978
elementType: Cl F O N C H
totalener: -2201.56829810 hartree
nucrepener: 3268.32216237 hartree
electener: -5469.89046048 hartree
oneelecener: -9527.85378327 hartree
twoeener: 4057.96332280 hartree
cpcmener: -0.03950265 hartree
kineticenergy: 2194.48531046 hartree
xcener: -175.414312082069 hartree
chargesum: -0.0000000
charge: -0.070999 -0.220388 -0.181866 -0.183387 -0.182888 -0.207974 -0.203971 -0.322157 -0.515129 -0.464058 -0.168788 -0.151619 0.256305 0.271845 0.038580 -0.061503 -0.253028 -0.184439 0.305995 -0.165733 -0.031423 -0.170281 -0.112234 -0.148423 0.556172 -0.127298 0.436384 0.413783 0.312882 0.302442 -0.243469 -0.243275 -0.063414 0.145448 0.164241 0.163330 0.163827 0.131372 0.154795 0.181713 0.198211 0.155665 0.154826 0.169931
qa: -0.0710 -0.2204 -0.1819 -0.1834 -0.1829 -0.2080 -0.2040 -0.3222 -0.5151 -0.4641 -0.1688 -0.1516 0.2563 0.2718 0.0386 -0.0615 -0.2530 -0.1844 0.3060 -0.1657 -0.0314 -0.1703 -0.1122 -0.1484 0.5562 -0.1273 0.4364 0.4138 0.3129 0.3024 -0.2435 -0.2433 -0.0634 0.1454 0.1642 0.1633 0.1638 0.1314 0.1548 0.1817 0.1982 0.1557 0.1548 0.1699
va: 1.2447 1.0663 1.1191 1.1029 1.1175 1.0871 1.0944 2.0896 1.9926 2.0492 3.2289 3.2270 3.7192 3.8084 3.8950 3.6971 4.0793 4.0127 3.8932 3.9282 3.9522 3.9362 4.0503 4.0124 4.4189 3.5503 4.3030 4.0579 3.9268 3.9526 3.9577 3.9548 3.8071 1.0124 0.9938 1.0244 0.9924 1.0279 1.0062 1.0775 1.0052 0.9995 1.0000 0.9835
dispcorr: -0.020605237 hartree
energy: -2201.588903338879
dipole: -32.65955 29.25961 -3.39994 4.33733 -3.38279 0.95454 -0.05053 -0.37731 -0.42784
magnitude: 3.55721 au
magnitude: 9.04172 debye
