program: Orca
programVersion: 5.0.2
elementType: Cl F F F F F F O O O N N C C C C C C C C C C C C C C C C C C C C C H H H H H H H H H H H
charge: 0
multiplicity: 1
keywords: wb97x-d3
keywords: def2-TZVPP
keywords: def2/J RIJCOSX
keywords: DEFGRID2
keywords: scfconv7
keywords: smallprint printgap noloewdin
keywords: NOSOSCF
formula: C21H11ClF6N2O3
InChI: InChI=1/C21H11ClF6N2O3/c22-12-8-10(21(26,27)28)4-7-17(12)33-11-5-6-16(15(25)9-11)29-20(32)30-19(31)18-13(23)2-1-3-14(18)24/h1-9,29-30H
44 atoms
Cl 5.311836 -2.395474 1.89426
F  -1.38386 -2.843654 -0.845601
F  7.469793 2.179353 -1.707548
F  7.161097 2.89034 0.295822
F  8.504879 1.255603 -0.064713
F  -6.069289 2.895872 1.045605
F  -7.019892 -1.293401 -0.772385
O  3.035502 -1.786607 0.254265
O  -2.617312 -0.505945 -2.023789
O  -4.605048 0.388658 1.48387
N  -2.36195 -0.481093 0.232229
N  -4.392885 0.089061 -0.766763
C  1.721478 -1.400035 0.232808
C  4.027594 -0.879656 0.07738
C  -0.990367 -0.786737 0.215941
C  6.194489 0.825829 -0.272412
C  0.828157 -2.283108 -0.353549
C  1.281874 -0.226771 0.8289
C  -0.514931 -1.970789 -0.329764
C  -0.068726 0.074194 0.797522
C  5.205371 -1.075935 0.791796
C  3.94214 0.181282 -0.814504
C  6.289601 -0.233716 0.617368
C  5.018224 1.032203 -0.984006
C  7.334611 1.780783 -0.43731
C  -6.501291 0.789434 0.139673
C  -3.061806 -0.321407 -0.906153
C  -5.080733 0.400017 0.364993
C  -6.95716 2.038627 0.536822
C  -7.436246 -0.079453 -0.401741
C  -8.271764 2.4268 0.394614
C  -8.765575 0.255163 -0.548101
C  -9.171218 1.519089 -0.146877
H  1.168189 -3.207766 -0.802037
H  1.971914 0.454498 1.308306
H  -0.420555 0.994104 1.245754
H  3.03932 0.341343 -1.388822
H  7.190718 -0.413203 1.187402
H  4.925829 1.849657 -1.686146
H  -2.78128 -0.1821 1.105312
H  -4.877991 0.180947 -1.651223
H  -8.585934 3.415149 0.700415
H  -9.466154 -0.456475 -0.962802
H  -10.20824 1.803328 -0.258625
elementType: Cl F O N C H
totalener: -2201.56796749 hartree
nucrepener: 3274.73387421 hartree
electener: -5476.30184171 hartree
oneelecener: -9540.94933726 hartree
twoeener: 4064.64749555 hartree
cpcmener: -0.04595212 hartree
kineticenergy: 2194.48913802 hartree
xcener: -175.410564961742 hartree
chargesum: 0.0000000
charge: -0.068824 -0.209513 -0.182791 -0.182435 -0.180903 -0.205005 -0.208267 -0.319439 -0.521490 -0.464851 -0.214539 -0.154973 0.274799 0.264486 0.070207 -0.059924 -0.236396 -0.172548 0.265082 -0.182925 -0.027395 -0.166868 -0.108283 -0.150510 0.556835 -0.135430 0.431452 0.416305 0.303539 0.316405 -0.246128 -0.245909 -0.064695 0.144972 0.163668 0.157315 0.165338 0.132998 0.154263 0.210028 0.202184 0.154508 0.155484 0.170173
qa: -0.0688 -0.2095 -0.1828 -0.1824 -0.1809 -0.2050 -0.2083 -0.3194 -0.5215 -0.4649 -0.2145 -0.1550 0.2748 0.2645 0.0702 -0.0599 -0.2364 -0.1725 0.2651 -0.1829 -0.0274 -0.1669 -0.1083 -0.1505 0.5568 -0.1354 0.4315 0.4163 0.3035 0.3164 -0.2461 -0.2459 -0.0647 0.1450 0.1637 0.1573 0.1653 0.1330 0.1543 0.2100 0.2022 0.1545 0.1555 0.1702
va: 1.2465 1.0843 1.1165 1.1053 1.1215 1.0932 1.0863 2.0958 1.9921 2.0406 3.1553 3.2075 3.7103 3.8062 3.6423 3.6980 4.0076 3.9485 4.0598 4.0368 3.9597 3.9436 4.0285 4.0197 4.4183 3.5417 4.3266 4.0709 3.9505 3.9265 3.9571 3.9599 3.8044 1.0127 0.9929 1.0035 0.9910 1.0269 1.0064 1.0298 1.0019 1.0000 0.9997 0.9833
dispcorr: -0.020836547 hartree
energy: -2201.588804042124
dipole: -32.13549 29.19516 -2.94033 2.92035 -1.51478 1.40557 -1.86906 1.84468 -0.02438
magnitude: 3.25911 au
magnitude: 8.28399 debye
