program: Orca
programVersion: 5.0.2
elementType: Cl F F F F F F O O O N N C C C C C C C C C C C C C C C C C C C C C H H H H H H H H H H H
charge: 0
multiplicity: 1
keywords: wb97x-d3
keywords: def2-TZVPP
keywords: def2/J RIJCOSX
keywords: DEFGRID2
keywords: scfconv7
keywords: smallprint printgap noloewdin
keywords: NOSOSCF
formula: C21H11ClF6N2O3
InChI: InChI=1/C21H11ClF6N2O3/c22-12-8-10(21(26,27)28)4-7-17(12)33-11-5-6-16(15(25)9-11)29-20(32)30-19(31)18-13(23)2-1-3-14(18)24/h1-9,29-30H
44 atoms
Cl 3.594927 -1.194859 2.108243
F  -1.357159 -2.920653 -0.161693
F  7.265241 2.740661 -0.364259
F  7.87227 1.661091 1.392748
F  8.645024 1.106083 -0.536207
F  -6.061592 3.100364 0.00494
F  -6.608572 -1.505332 0.543849
O  3.169038 -1.928583 -0.722735
O  -2.851841 -1.240583 -2.085469
O  -4.095537 1.11733 1.075509
N  -2.105182 -0.259595 -0.182331
N  -4.349874 -0.132067 -0.815614
C  1.891612 -1.453428 -0.591631
C  4.216029 -1.079751 -0.511446
C  -0.766032 -0.658061 -0.351879
C  6.395483 0.578835 -0.092773
C  0.901141 -2.416265 -0.454431
C  1.575482 -0.103152 -0.611529
C  -0.405279 -1.999374 -0.32981
C  0.247111 0.27704 -0.497658
C  4.541079 -0.65936 0.773299
C  4.992235 -0.673691 -1.584353
C  5.626725 0.172149 0.987534
C  6.085033 0.149001 -1.377875
C  7.545614 1.517105 0.106359
C  -6.287013 0.788991 0.255623
C  -3.05171 -0.584657 -1.079678
C  -4.805527 0.615892 0.225715
C  -6.864385 2.048922 0.182283
C  -7.145017 -0.286003 0.436864
C  -8.226094 2.246406 0.262529
C  -8.51188 -0.138611 0.536708
C  -9.042551 1.139362 0.444017
H  1.146003 -3.470426 -0.426996
H  2.336748 0.656524 -0.727307
H  -0.007574 1.328299 -0.521535
H  4.738828 -1.009538 -2.581059
H  5.856296 0.487829 1.995573
H  6.678793 0.455309 -2.228852
H  -2.33484 0.383354 0.565908
H  -5.028372 -0.43486 -1.504341
H  -8.638337 3.24314 0.185713
H  -9.145294 -1.001629 0.688785
H  -10.112502 1.275893 0.515783
elementType: Cl F O N C H
totalener: -2201.56757337 hartree
nucrepener: 3312.43092958 hartree
electener: -5513.99850295 hartree
oneelecener: -9616.70059689 hartree
twoeener: 4102.70209394 hartree
cpcmener: -0.04644578 hartree
kineticenergy: 2194.48034397 hartree
xcener: -175.408335901526 hartree
chargesum: -0.0000000
charge: -0.060692 -0.210516 -0.182028 -0.179782 -0.182712 -0.204690 -0.208359 -0.320057 -0.524330 -0.464891 -0.214100 -0.156927 0.229351 0.203840 0.071182 -0.037493 -0.218838 -0.139229 0.263426 -0.204224 0.052950 -0.153033 -0.131406 -0.160461 0.562639 -0.131280 0.429376 0.412997 0.307758 0.307649 -0.245217 -0.241118 -0.068073 0.143040 0.156845 0.157163 0.156365 0.135302 0.156201 0.211192 0.202852 0.154381 0.155440 0.169505
qa: -0.0607 -0.2105 -0.1820 -0.1798 -0.1827 -0.2047 -0.2084 -0.3201 -0.5243 -0.4649 -0.2141 -0.1569 0.2294 0.2038 0.0712 -0.0375 -0.2188 -0.1392 0.2634 -0.2042 0.0529 -0.1530 -0.1314 -0.1605 0.5626 -0.1313 0.4294 0.4130 0.3078 0.3076 -0.2452 -0.2411 -0.0681 0.1430 0.1568 0.1572 0.1564 0.1353 0.1562 0.2112 0.2029 0.1544 0.1554 0.1695
va: 1.2527 1.0838 1.1096 1.1244 1.1166 1.0934 1.0857 2.0879 1.9896 2.0396 3.1469 3.2006 3.7109 3.8112 3.6138 3.6880 3.9992 3.8767 4.0877 4.0776 3.9701 3.9735 4.0524 4.0137 4.4114 3.5384 4.3311 4.0795 3.9507 3.9323 3.9558 3.9579 3.8092 1.0155 0.9983 1.0037 0.9999 1.0261 1.0046 1.0267 1.0011 1.0002 0.9993 0.9836
dispcorr: -0.021524840 hartree
energy: -2201.589098205901
dipole: -27.66857 25.69391 -1.97466 -0.46890 1.45513 0.98623 -7.50959 7.22743 -0.28216
magnitude: 2.22521 au
magnitude: 5.65603 debye
