program: Orca
programVersion: 5.0.2
elementType: Cl F F F F F F O O O N N C C C C C C C C C C C C C C C C C C C C C H H H H H H H H H H H
charge: 0
multiplicity: 1
keywords: wb97x-d3
keywords: def2-TZVPP
keywords: def2/J RIJCOSX
keywords: DEFGRID2
keywords: scfconv7
keywords: smallprint printgap noloewdin
keywords: NOSOSCF
formula: C21H11ClF6N2O3
InChI: InChI=1/C21H11ClF6N2O3/c22-12-8-10(21(26,27)28)4-7-17(12)33-11-5-6-16(15(25)9-11)29-20(32)30-19(31)18-13(23)2-1-3-14(18)24/h1-9,29-30H
44 atoms
Cl 5.262912 -2.097747 -2.433823
F  -0.556316 1.2395 -1.265796
F  7.18891 2.612845 0.301145
F  7.410319 1.535454 2.145343
F  8.483757 0.900686 0.392064
F  -6.880783 0.585748 -2.047156
F  -6.402875 0.135524 2.57219
O  2.977827 -1.859426 -0.7081
O  -2.139074 1.291585 1.152369
O  -4.982793 -1.118151 -0.618294
N  -2.386552 -0.530599 -0.181009
N  -4.233138 0.670053 0.581275
C  1.670997 -1.478031 -0.536551
C  3.982114 -1.041384 -0.312109
C  -1.019325 -0.836735 -0.274323
C  6.162406 0.505599 0.441105
C  1.229577 -0.22845 -0.949365
C  0.793668 -2.411044 -0.01053
C  -0.111431 0.062026 -0.819861
C  -0.544943 -2.079858 0.119906
C  5.162914 -1.078034 -1.048662
C  3.901676 -0.223602 0.807019
C  6.252509 -0.312693 -0.675916
C  4.985907 0.549019 1.17933
C  7.312549 1.381638 0.82069
C  -6.593815 0.363388 0.257198
C  -2.841685 0.505562 0.545815
C  -5.199279 -0.112332 0.030456
C  -7.409944 0.664137 -0.824188
C  -7.16236 0.452021 1.518571
C  -8.722765 1.055857 -0.676881
C  -8.474603 0.825631 1.717528
C  -9.246572 1.129651 0.606023
H  1.900241 0.500286 -1.387986
H  1.151064 -3.383583 0.299172
H  -1.238194 -2.797788 0.537989
H  2.996121 -0.194582 1.39874
H  7.156247 -0.361629 -1.267924
H  4.898787 1.17532 2.056627
H  -3.059414 -1.189201 -0.557081
H  -4.529155 1.493772 1.091263
H  -9.32174 1.295924 -1.54466
H  -8.883294 0.873482 2.717519
H  -10.276683 1.428311 0.741451
elementType: Cl F O N C H
totalener: -2201.56813803 hartree
nucrepener: 3285.18770914 hartree
electener: -5486.75584717 hartree
oneelecener: -9561.99936573 hartree
twoeener: 4075.24351856 hartree
cpcmener: -0.04532910 hartree
kineticenergy: 2194.49351699 hartree
xcener: -175.411022399025 hartree
chargesum: -0.0000000
charge: -0.069020 -0.209610 -0.183065 -0.182114 -0.181794 -0.204872 -0.208558 -0.320294 -0.520261 -0.464564 -0.213336 -0.154823 0.236831 0.248674 0.067331 -0.058107 -0.143985 -0.215262 0.249138 -0.175217 -0.023288 -0.151637 -0.109942 -0.154217 0.556522 -0.135812 0.429670 0.418172 0.297404 0.320159 -0.243820 -0.246289 -0.065799 0.157568 0.153323 0.157783 0.164437 0.131407 0.154590 0.210916 0.202062 0.154869 0.154888 0.169942
qa: -0.0690 -0.2096 -0.1831 -0.1821 -0.1818 -0.2049 -0.2086 -0.3203 -0.5203 -0.4646 -0.2133 -0.1548 0.2368 0.2487 0.0673 -0.0581 -0.1440 -0.2153 0.2491 -0.1752 -0.0233 -0.1516 -0.1099 -0.1542 0.5565 -0.1358 0.4297 0.4182 0.2974 0.3202 -0.2438 -0.2463 -0.0658 0.1576 0.1533 0.1578 0.1644 0.1314 0.1546 0.2109 0.2021 0.1549 0.1549 0.1699
va: 1.2463 1.0855 1.1036 1.1179 1.1200 1.0934 1.0859 2.0911 1.9940 2.0421 3.1538 3.2103 3.7390 3.8179 3.6315 3.6925 3.9135 4.0269 4.0684 4.0261 3.9537 3.9259 4.0411 4.0227 4.4177 3.5445 4.3289 4.0685 3.9555 3.9237 3.9568 3.9593 3.8066 0.9998 1.0031 1.0022 0.9918 1.0277 1.0064 1.0309 1.0019 0.9998 0.9999 0.9835
dispcorr: -0.020886266 hartree
energy: -2201.589024301114
dipole: -33.69563 30.36840 -3.32723 -4.82610 4.63805 -0.18806 5.27240 -4.43447 0.83792
magnitude: 3.43627 au
magnitude: 8.73430 debye
