program: Orca
programVersion: 5.0.2
elementType: Cl F F F F F F O O O N N C C C C C C C C C C C C C C C C C C C C C H H H H H H H H H H H
charge: 0
multiplicity: 1
keywords: wb97x-d3
keywords: def2-TZVPP
keywords: def2/J RIJCOSX
keywords: DEFGRID2
keywords: scfconv7
keywords: smallprint printgap noloewdin
keywords: NOSOSCF
formula: C21H11ClF6N2O3
InChI: InChI=1/C21H11ClF6N2O3/c22-12-8-10(21(26,27)28)4-7-17(12)33-11-5-6-16(15(25)9-11)29-20(32)30-19(31)18-13(23)2-1-3-14(18)24/h1-9,29-30H
44 atoms
Cl 3.439594 1.174635 -2.224265
F  -0.315366 -0.253089 1.254625
F  8.37543 0.419732 1.324836
F  7.417013 2.301502 0.912028
F  6.862196 1.166565 2.651754
F  -5.377494 2.380184 1.394486
F  -7.009043 -1.732907 -0.087706
O  3.239634 -1.695869 -1.539901
O  -3.097136 -0.863034 -2.639716
O  -3.958843 -0.198354 1.343397
N  -2.176942 -0.898377 -0.55004
N  -4.417069 -0.371798 -0.880771
C  1.915078 -1.487337 -1.271618
C  4.173914 -1.011898 -0.827489
C  -0.832999 -1.128966 -0.858011
C  6.148921 0.343007 0.570857
C  1.470746 -0.949826 -0.0733
C  1.005679 -1.868556 -2.245013
C  0.115504 -0.77989 0.09816
C  -0.35328 -1.699962 -2.035541
C  4.388818 0.344114 -1.050478
C  4.953294 -1.685116 0.099799
C  5.371632 1.025569 -0.353108
C  5.94346 -1.013787 0.794279
C  7.201416 1.061972 1.35897
C  -6.150121 0.315715 0.634287
C  -3.178177 -0.73414 -1.435607
C  -4.738695 -0.117045 0.415069
C  -6.413245 1.57101 1.164643
C  -7.239226 -0.5090 0.39799
C  -7.691261 2.009312 1.435907
C  -8.535559 -0.120839 0.664569
C  -8.748947 1.147955 1.182086
H  2.144133 -0.657779 0.722944
H  1.354517 -2.299308 -3.174377
H  -1.036168 -2.015923 -2.807473
H  4.782154 -2.740413 0.268629
H  5.517583 2.079325 -0.545915
H  6.542849 -1.558358 1.512252
H  -2.405431 -0.703099 0.420753
H  -5.136124 -0.230569 -1.5796
H  -7.855733 3.000466 1.836749
H  -9.357862 -0.797554 0.475575
H  -9.758821 1.471283 1.39438
elementType: Cl F O N C H
totalener: -2201.57988678 hartree
nucrepener: 3329.13707760 hartree
electener: -5530.71696439 hartree
oneelecener: -9649.83768848 hartree
twoeener: 4119.12072409 hartree
cpcmener: -0.03409835 hartree
kineticenergy: 2194.48317667 hartree
xcener: -175.410758705529 hartree
chargesum: 0.0000000
charge: -0.058339 -0.217664 -0.181618 -0.178791 -0.180929 -0.201870 -0.206408 -0.314430 -0.489800 -0.440762 -0.190639 -0.155448 0.202058 0.202766 0.051839 -0.041411 -0.141032 -0.206137 0.251228 -0.158878 0.050161 -0.155262 -0.129357 -0.159615 0.561690 -0.134817 0.421742 0.398277 0.299912 0.317110 -0.244092 -0.245303 -0.064093 0.143129 0.146199 0.154186 0.153619 0.134784 0.153109 0.184801 0.197227 0.153275 0.152806 0.166779
qa: -0.0583 -0.2177 -0.1816 -0.1788 -0.1809 -0.2019 -0.2064 -0.3144 -0.4898 -0.4408 -0.1906 -0.1554 0.2021 0.2028 0.0518 -0.0414 -0.1410 -0.2061 0.2512 -0.1589 0.0502 -0.1553 -0.1294 -0.1596 0.5617 -0.1348 0.4217 0.3983 0.2999 0.3171 -0.2441 -0.2453 -0.0641 0.1431 0.1462 0.1542 0.1536 0.1348 0.1531 0.1848 0.1972 0.1533 0.1528 0.1668
va: 1.2548 1.0714 1.1175 1.1257 1.1121 1.0975 1.0882 2.0959 2.0228 2.0755 3.2126 3.2086 3.7382 3.8271 3.7924 3.7010 3.8685 4.0403 4.0221 3.9776 3.9720 3.9676 4.0467 4.0193 4.4121 3.5472 4.3195 4.0849 3.9612 3.9347 3.9626 3.9625 3.8078 1.0105 1.0088 1.0219 1.0016 1.0264 1.0057 1.0725 1.0048 1.0004 1.0009 0.9847
dispcorr: -0.021383948 hartree
energy: -2201.601270732715
dipole: -28.25527 25.96261 -2.29266 -9.71937 9.52395 -0.19542 -5.20804 5.59387 0.38584
magnitude: 2.33310 au
magnitude: 5.93026 debye
