program: Orca
programVersion: 5.0.2
elementType: Cl F F F F F F O O O N N C C C C C C C C C C C C C C C C C C C C C H H H H H H H H H H H
charge: 0
multiplicity: 1
keywords: wb97x-d3
keywords: def2-TZVPP
keywords: def2/J RIJCOSX
keywords: DEFGRID2
keywords: scfconv7
keywords: smallprint printgap noloewdin
keywords: NOSOSCF
formula: C21H11ClF6N2O3
InChI: InChI=1/C21H11ClF6N2O3/c22-12-8-10(21(26,27)28)4-7-17(12)33-11-5-6-16(15(25)9-11)29-20(32)30-19(31)18-13(23)2-1-3-14(18)24/h1-9,29-30H
44 atoms
Cl 5.279774 -3.041707 0.595913
F  -1.34975 -2.065156 -2.095391
F  7.554509 2.656016 -0.430667
F  7.321883 2.283894 1.67171
F  8.584466 1.007986 0.489756
F  -7.103396 -1.355791 1.408177
F  -6.047006 2.768926 -0.520933
O  3.024515 -1.67511 -0.518913
O  -2.686749 0.383736 -2.144373
O  -4.559736 -0.080427 1.492871
N  -2.371898 -0.459306 -0.059415
N  -4.451968 0.34581 -0.741797
C  1.716661 -1.297279 -0.396784
C  4.034181 -0.8144 -0.263659
C  -1.001074 -0.721053 -0.198254
C  6.254377 0.798937 0.196633
C  0.840813 -1.796967 -1.347384
C  1.255545 -0.526198 0.660695
C  -0.504472 -1.523193 -1.217299
C  -0.095523 -0.233667 0.73657
C  5.20934 -1.354573 0.253017
C  3.979065 0.544714 -0.544194
C  6.317632 -0.5583 0.478851
C  5.081408 1.346451 -0.309328
C  7.429643 1.681972 0.478382
C  -6.522453 0.686371 0.433319
C  -3.105371 0.101645 -1.041528
C  -5.087203 0.283819 0.460826
C  -7.490075 -0.160562 0.961869
C  -6.957417 1.920285 -0.032985
C  -8.824918 0.177432 1.013935
C  -8.279983 2.30769 0.008096
C  -9.208582 1.421351 0.533379
H  1.195414 -2.417431 -2.160947
H  1.928286 -0.151217 1.420825
H  -0.461905 0.379093 1.550564
H  3.080339 0.983762 -0.957763
H  7.214759 -1.011408 0.878835
H  5.00932 2.401256 -0.538314
H  -2.786684 -0.545042 0.86133
H  -4.985735 0.647515 -1.547186
H  -9.549051 -0.516354 1.420124
H  -8.576458 3.281238 -0.359012
H  -10.251336 1.705524 0.570833
elementType: Cl F O N C H
totalener: -2201.57974353 hartree
nucrepener: 3270.50740078 hartree
electener: -5472.08714431 hartree
oneelecener: -9532.48350027 hartree
twoeener: 4060.39635596 hartree
cpcmener: -0.03803445 hartree
kineticenergy: 2194.48959001 hartree
xcener: -175.409536356539 hartree
chargesum: -0.0000000
charge: -0.066514 -0.206254 -0.181929 -0.180974 -0.180879 -0.200120 -0.206576 -0.310836 -0.485861 -0.448846 -0.216321 -0.159615 0.272713 0.270415 0.073889 -0.065176 -0.235405 -0.180125 0.270121 -0.181250 -0.032333 -0.173598 -0.103865 -0.146493 0.555079 -0.139739 0.411272 0.410775 0.295698 0.312724 -0.237753 -0.242821 -0.063233 0.142567 0.161700 0.153883 0.162078 0.130203 0.152546 0.204147 0.194106 0.152887 0.152884 0.166830
qa: -0.0665 -0.2063 -0.1819 -0.1810 -0.1809 -0.2001 -0.2066 -0.3108 -0.4859 -0.4488 -0.2163 -0.1596 0.2727 0.2704 0.0739 -0.0652 -0.2354 -0.1801 0.2701 -0.1813 -0.0323 -0.1736 -0.1039 -0.1465 0.5551 -0.1397 0.4113 0.4108 0.2957 0.3127 -0.2378 -0.2428 -0.0632 0.1426 0.1617 0.1539 0.1621 0.1302 0.1525 0.2041 0.1941 0.1529 0.1529 0.1668
va: 1.2491 1.0879 1.1181 1.1070 1.1212 1.0995 1.0883 2.1048 2.0347 2.0601 3.1557 3.2035 3.7172 3.8108 3.6594 3.7121 4.0104 3.9641 4.0499 4.0283 3.9588 3.9456 4.0283 4.0195 4.4191 3.5438 4.3495 4.0842 3.9589 3.9297 3.9561 3.9602 3.8118 1.0138 0.9936 1.0044 0.9925 1.0281 1.0068 1.0358 1.0079 1.0005 1.0008 0.9847
dispcorr: -0.020707047 hartree
energy: -2201.600450576674
dipole: -32.52155 29.48117 -3.04038 3.60728 -2.57485 1.03243 -0.32677 0.88149 0.55472
magnitude: 3.25845 au
magnitude: 8.28233 debye
