program: Orca
programVersion: 5.0.2
elementType: Cl F F F F F F O O O N N C C C C C C C C C C C C C C C C C C C C C H H H H H H H H H H H
charge: 0
multiplicity: 1
keywords: wb97x-d3
keywords: def2-TZVPP
keywords: def2/J RIJCOSX
keywords: DEFGRID2
keywords: scfconv7
keywords: smallprint printgap noloewdin
keywords: NOSOSCF
formula: C21H11ClF6N2O3
InChI: InChI=1/C21H11ClF6N2O3/c22-12-8-10(21(26,27)28)4-7-17(12)33-11-5-6-16(15(25)9-11)29-20(32)30-19(31)18-13(23)2-1-3-14(18)24/h1-9,29-30H
44 atoms
Cl 3.584279 -1.159678 2.118684
F  -1.343044 -2.953193 -0.200548
F  7.247604 2.76037 -0.317512
F  7.913753 1.638178 1.393078
F  8.637638 1.143605 -0.572728
F  -6.039308 3.097557 -0.013149
F  -6.627822 -1.499815 0.563946
O  3.173898 -1.912601 -0.715614
O  -2.874887 -1.274381 -2.09709
O  -4.086092 1.093663 1.065691
N  -2.114764 -0.294366 -0.19844
N  -4.363963 -0.166331 -0.81426
C  1.894127 -1.450215 -0.597517
C  4.216045 -1.065768 -0.500297
C  -0.774337 -0.683222 -0.371519
C  6.404043 0.585783 -0.082811
C  0.911122 -2.423246 -0.478448
C  1.564253 -0.103068 -0.612585
C  -0.400882 -2.021433 -0.358968
C  0.231029 0.262156 -0.506739
C  4.537347 -0.636985 0.78345
C  5.00127 -0.669917 -1.571224
C  5.626764 0.190992 0.99619
C  6.096878 0.148814 -1.366195
C  7.552845 1.526843 0.11185
C  -6.285294 0.789157 0.257295
C  -3.067005 -0.619931 -1.092805
C  -4.804893 0.597154 0.222578
C  -6.849939 2.054737 0.178102
C  -7.153273 -0.275997 0.451525
C  -8.209782 2.265817 0.264174
C  -8.518553 -0.114508 0.555844
C  -9.036642 1.168288 0.456569
H  1.16661 -3.475311 -0.458593
H  2.318156 0.665896 -0.716525
H  -0.035217 1.311064 -0.525765
H  4.751468 -1.012852 -2.566883
H  5.852219 0.512862 2.003815
H  6.694805 0.444988 -2.218082
H  -2.349422 0.33555 0.559663
H  -5.044035 -0.454678 -1.507296
H  -8.613096 3.266463 0.184449
H  -9.160631 -0.970391 0.715463
H  -10.105207 1.316749 0.532591
elementType: Cl F O N C H
totalener: -2201.57963898 hartree
nucrepener: 3310.73733093 hartree
electener: -5512.31696991 hartree
oneelecener: -9613.23562362 hartree
twoeener: 4100.91865370 hartree
cpcmener: -0.03865116 hartree
kineticenergy: 2194.47485434 hartree
xcener: -175.405441477334 hartree
chargesum: 0.0000000
charge: -0.058146 -0.207968 -0.180498 -0.178974 -0.181605 -0.202189 -0.206173 -0.311298 -0.490892 -0.445204 -0.220377 -0.160137 0.231230 0.196236 0.074973 -0.036613 -0.219770 -0.141572 0.265809 -0.202171 0.053695 -0.151929 -0.135036 -0.157313 0.560092 -0.133226 0.411099 0.401689 0.306414 0.304430 -0.243869 -0.240499 -0.066608 0.140207 0.153376 0.153455 0.153863 0.134713 0.153563 0.207069 0.198765 0.151948 0.153255 0.166184
qa: -0.0581 -0.2080 -0.1805 -0.1790 -0.1816 -0.2022 -0.2062 -0.3113 -0.4909 -0.4452 -0.2204 -0.1601 0.2312 0.1962 0.0750 -0.0366 -0.2198 -0.1416 0.2658 -0.2022 0.0537 -0.1519 -0.1350 -0.1573 0.5601 -0.1332 0.4111 0.4017 0.3064 0.3044 -0.2439 -0.2405 -0.0666 0.1402 0.1534 0.1535 0.1539 0.1347 0.1536 0.2071 0.1988 0.1519 0.1533 0.1662
va: 1.2550 1.0878 1.1105 1.1255 1.1186 1.0970 1.0883 2.0992 2.0323 2.0639 3.1346 3.1910 3.7176 3.8252 3.6148 3.6942 4.0010 3.8839 4.0937 4.0820 3.9702 3.9748 4.0577 4.0144 4.4132 3.5389 4.3540 4.0933 3.9571 3.9379 3.9588 3.9621 3.8123 1.0164 0.9996 1.0050 1.0010 1.0264 1.0059 1.0315 1.0037 1.0011 1.0002 0.9849
dispcorr: -0.021501145 hartree
energy: -2201.601140130212
dipole: -27.69928 25.75312 -1.94616 -0.49830 1.41340 0.91510 -7.45810 7.19221 -0.26589
magnitude: 2.16694 au
magnitude: 5.50793 debye
