program: Orca
programVersion: 5.0.2
elementType: Cl F F F F F F O O O N N C C C C C C C C C C C C C C C C C C C C C H H H H H H H H H H H
charge: 0
multiplicity: 1
keywords: wb97x-d3
keywords: def2-TZVPP
keywords: def2/J RIJCOSX
keywords: DEFGRID2
keywords: scfconv7
keywords: smallprint printgap noloewdin
keywords: NOSOSCF
formula: C21H11ClF6N2O3
InChI: InChI=1/C21H11ClF6N2O3/c22-12-8-10(21(26,27)28)4-7-17(12)33-11-5-6-16(15(25)9-11)29-20(32)30-19(31)18-13(23)2-1-3-14(18)24/h1-9,29-30H
44 atoms
Cl 3.439926 -1.808837 1.475239
F  -1.313151 -2.7119 -1.461855
F  7.835613 2.414687 0.119034
F  7.330187 1.647625 2.064768
F  8.621855 0.523484 0.767709
F  -6.856858 -1.198014 -0.981579
F  -5.838502 2.766221 1.256807
O  3.191168 -1.49837 -1.45646
O  -2.508839 -1.713206 0.988511
O  -4.337583 1.401312 -1.024659
N  -2.151051 -0.197886 -0.66129
N  -4.232154 -0.391073 0.382097
C  1.897779 -1.121846 -1.230276
C  4.204512 -0.78442 -0.897602
C  -0.791609 -0.511241 -0.836663
C  6.343698 0.596963 0.201913
C  0.937729 -2.104557 -1.428391
C  1.533913 0.162958 -0.85585
C  -0.386865 -1.776726 -1.243223
C  0.192778 0.448306 -0.650945
C  4.451234 -0.844539 0.471199
C  5.037405 -0.034398 -1.7103
C  5.516755 -0.156911 1.02394
C  6.111399 0.648902 -1.166396
C  7.52927 1.29956 0.789398
C  -6.305863 0.778478 0.128688
C  -2.902429 -0.819827 0.267385
C  -4.864892 0.637595 -0.242903
C  -7.262685 -0.140011 -0.273308
C  -6.748464 1.878758 0.847118
C  -8.602834 0.008556 0.01629
C  -8.075564 2.067835 1.16887
C  -8.997047 1.12164 0.74363
H  1.218317 -3.106242 -1.729042
H  2.271367 0.941165 -0.710132
H  -0.096873 1.444338 -0.341607
H  4.845194 0.005442 -2.774534
H  5.688952 -0.221967 2.089929
H  6.751338 1.22355 -1.822088
H  -2.533968 0.606945 -1.14328
H  -4.763813 -0.919612 1.063023
H  -9.320493 -0.727023 -0.321161
H  -8.381714 2.933316 1.740844
H  -10.04294 1.254019 0.98451
elementType: Cl F O N C H
totalener: -2201.57924721 hartree
nucrepener: 3316.24384686 hartree
electener: -5517.82309408 hartree
oneelecener: -9624.37506920 hartree
twoeener: 4106.55197513 hartree
cpcmener: -0.03867775 hartree
kineticenergy: 2194.49498482 hartree
xcener: -175.408625869043 hartree
chargesum: -0.0000000
charge: -0.056435 -0.207436 -0.180106 -0.180369 -0.179546 -0.206148 -0.203494 -0.312077 -0.488366 -0.443961 -0.219271 -0.156147 0.209836 0.195814 0.075734 -0.035621 -0.205464 -0.134301 0.264838 -0.200649 0.053793 -0.161268 -0.139294 -0.142403 0.555935 -0.134423 0.412051 0.394467 0.313470 0.311005 -0.247803 -0.250789 -0.064694 0.139779 0.154216 0.152799 0.154248 0.133515 0.151776 0.206109 0.199414 0.152498 0.152619 0.166148
qa: -0.0564 -0.2074 -0.1801 -0.1804 -0.1795 -0.2061 -0.2035 -0.3121 -0.4884 -0.4440 -0.2193 -0.1561 0.2098 0.1958 0.0757 -0.0356 -0.2055 -0.1343 0.2648 -0.2006 0.0538 -0.1613 -0.1393 -0.1424 0.5559 -0.1344 0.4121 0.3945 0.3135 0.3110 -0.2478 -0.2508 -0.0647 0.1398 0.1542 0.1528 0.1542 0.1335 0.1518 0.2061 0.1994 0.1525 0.1526 0.1661
va: 1.2567 1.0883 1.1219 1.1221 1.1095 1.0881 1.0953 2.0949 2.0347 2.0643 3.1412 3.1909 3.7358 3.8255 3.6187 3.6923 3.9847 3.8831 4.0867 4.0781 3.9709 3.9810 4.0798 3.9924 4.4157 3.5418 4.3487 4.0961 3.9397 3.9552 3.9653 3.9650 3.8068 1.0160 0.9985 1.0053 1.0016 1.0273 1.0069 1.0317 1.0026 1.0007 1.0008 0.9848
dispcorr: -0.021551000 hartree
energy: -2201.600798213078
dipole: -27.32222 25.34680 -1.97542 2.54544 -1.33883 1.20661 -6.39415 6.04473 -0.34942
magnitude: 2.34100 au
magnitude: 5.95035 debye
