program: Orca
programVersion: 5.0.2
elementType: Cl F F O O O N N N C C C C C C C C C C C C C C C C C C C C C C C C C H H H H H H H H H H H H H H H H H H H H
charge: 0
multiplicity: 1
keywords: wb97x-d3
keywords: def2-TZVPP
keywords: def2/J RIJCOSX
keywords: DEFGRID2
keywords: scfconv7
keywords: smallprint printgap noloewdin
keywords: NOSOSCF
formula: C25H20ClF2N3O3
InChI: InChI=1/C25H20ClF2N3O3/c26-18-10-8-17(9-11-18)23(16-6-7-16)31-34-14-15-4-12-19(13-5-15)29-25(33)30-24(32)22-20(27)2-1-3-21(22)28/h1-5,8-13,16,29-30H,6-7,14H2
54 atoms
Cl 6.229374 4.563023 1.391689
F  -7.05409 -0.924445 1.375969
F  -5.390548 2.476925 -1.358756
O  3.888661 -2.963404 0.156103
O  -2.585633 -1.10488 -2.231224
O  -4.333967 0.083824 1.324172
N  4.12132 -1.677292 0.551964
N  -2.221032 -1.007831 0.022491
N  -4.195388 -0.225644 -0.929548
C  5.631985 -1.696884 -1.362097
C  4.829697 -1.986114 -2.598909
C  5.875017 -0.919317 -2.617097
C  4.961828 -1.07013 -0.192927
C  5.262085 0.323923 0.188072
C  6.534229 0.852648 -0.025649
C  4.293874 1.134247 0.781461
C  6.841326 2.150482 0.349567
C  4.584053 2.436191 1.152765
C  5.859872 2.933811 0.935301
C  2.828236 -3.51877 0.915863
C  1.511263 -2.847866 0.650339
C  0.674511 -2.48402 1.697982
C  1.08826 -2.577436 -0.646295
C  -0.970938 -1.624823 0.154406
C  -0.551049 -1.888592 1.458167
C  -0.130772 -1.969636 -0.904865
C  -2.931529 -0.813264 -1.101639
C  -6.176956 0.751571 0.009148
C  -4.813666 0.182992 0.209993
C  -7.266372 0.17382 0.647968
C  -6.423937 1.884838 -0.752463
C  -8.545799 0.671581 0.531811
C  -7.683772 2.429044 -0.886707
C  -8.741615 1.807532 -0.240542
H  6.377895 -2.442063 -1.102952
H  3.79311 -1.67296 -2.613061
H  5.022017 -2.917877 -3.114219
H  6.798413 -1.10471 -3.149478
H  5.539364 0.109416 -2.652014
H  7.305857 0.247295 -0.482696
H  3.29367 0.755019 0.942052
H  7.835692 2.541767 0.183749
H  3.818597 3.055468 1.600015
H  2.798654 -4.567203 0.612947
H  3.06141 -3.490706 1.984408
H  0.97971 -2.667619 2.721126
H  1.716742 -2.840111 -1.488956
H  -1.186258 -1.618284 2.293226
H  -0.404695 -1.772819 -1.927714
H  -2.673337 -0.736023 0.890123
H  -4.706039 -0.130939 -1.79905
H  -9.369984 0.18195 1.032105
H  -7.832691 3.319524 -1.481683
H  -9.737557 2.215975 -0.339826
elementType: Cl F O N C H
totalener: -2014.65216104 hartree
nucrepener: 3308.03356331 hartree
electener: -5322.68572436 hartree
oneelecener: -9336.16051958 hartree
twoeener: 4013.47479522 hartree
cpcmener: -0.04815811 hartree
kineticenergy: 2007.65584042 hartree
xcener: -167.135099643110 hartree
chargesum: -0.0000000
charge: -0.096820 -0.204688 -0.208006 -0.232708 -0.521451 -0.467085 -0.162185 -0.172021 -0.150579 -0.075857 -0.187863 -0.187834 0.214098 0.038752 -0.217933 -0.212268 -0.149452 -0.156272 0.106812 0.105387 -0.027962 -0.158179 -0.209452 0.176729 -0.204126 -0.207291 0.431567 -0.127356 0.409164 0.299193 0.316118 -0.242604 -0.244521 -0.066036 0.117757 0.093954 0.099595 0.097747 0.103264 0.160640 0.140981 0.145287 0.145501 0.111250 0.099737 0.145332 0.150173 0.145091 0.156107 0.202744 0.198021 0.154559 0.154986 0.170004
qa: -0.0968 -0.2047 -0.2080 -0.2327 -0.5215 -0.4671 -0.1622 -0.1720 -0.1506 -0.0759 -0.1879 -0.1878 0.2141 0.0388 -0.2179 -0.2123 -0.1495 -0.1563 0.1068 0.1054 -0.0280 -0.1582 -0.2095 0.1767 -0.2041 -0.2073 0.4316 -0.1274 0.4092 0.2992 0.3161 -0.2426 -0.2445 -0.0660 0.1178 0.0940 0.0996 0.0977 0.1033 0.1606 0.1410 0.1453 0.1455 0.1112 0.0997 0.1453 0.1502 0.1451 0.1561 0.2027 0.1980 0.1546 0.1550 0.1700
va: 1.2086 1.0933 1.0867 1.9596 1.9838 2.0428 2.9097 3.2560 3.2178 3.7993 3.9124 3.9263 3.7512 3.5890 3.9828 4.0348 3.9898 4.0083 3.8282 3.8294 3.6499 3.9694 3.9919 3.8157 3.9501 3.9825 4.3036 3.5449 4.0672 3.9531 3.9280 3.9576 3.9569 3.8072 1.0056 1.0149 1.0146 1.0164 1.0068 0.9930 1.0182 1.0062 1.0063 0.9935 1.0105 0.9995 1.0066 1.0068 1.0311 1.0367 1.0052 0.9999 1.0000 0.9835
dispcorr: -0.025593048 hartree
energy: -2014.677754091306
dipole: 23.99585 -26.10539 -2.10954 -20.49987 20.56889 0.06902 -9.46078 8.93831 -0.52247
magnitude: 2.17437 au
magnitude: 5.52682 debye
