program: Orca
programVersion: 5.0.2
elementType: Cl F F O O O N N N C C C C C C C C C C C C C C C C C C C C C C C C C H H H H H H H H H H H H H H H H H H H H
charge: 0
multiplicity: 1
keywords: wb97x-d3
keywords: def2-TZVPP
keywords: def2/J RIJCOSX
keywords: DEFGRID2
keywords: scfconv7
keywords: smallprint printgap noloewdin
keywords: NOSOSCF
formula: C25H20ClF2N3O3
InChI: InChI=1/C25H20ClF2N3O3/c26-18-10-8-17(9-11-18)23(16-6-7-16)31-34-14-15-4-12-19(13-5-15)29-25(33)30-24(32)22-20(27)2-1-3-21(22)28/h1-5,8-13,16,29-30H,6-7,14H2
54 atoms
Cl 7.635187 4.175192 -0.99753
F  -6.052376 2.130774 1.956182
F  -7.28666 -1.077509 -1.208986
O  3.553367 -2.565966 0.199935
O  -3.116273 -0.104017 -2.595368
O  -4.583175 -0.276624 1.273436
N  4.12197 -1.396444 -0.21799
N  -2.558735 -0.756964 -0.477079
N  -4.638729 0.170286 -0.96092
C  4.874638 -1.307269 2.097855
C  5.690995 -2.528138 2.414927
C  6.127954 -1.187178 2.905689
C  4.799059 -0.816807 0.697184
C  5.504835 0.41056 0.282043
C  5.997005 0.545463 -1.016605
C  5.684059 1.465189 1.176121
C  6.649706 1.698838 -1.41642
C  6.328609 2.628679 0.787337
C  6.809734 2.733633 -0.508039
C  2.656841 -3.060272 -0.779328
C  1.311594 -2.391838 -0.727521
C  0.630681 -2.062544 -1.89038
C  0.684124 -2.138716 0.490315
C  -1.266616 -1.271971 -0.642744
C  -0.645913 -1.513359 -1.8656
C  -0.579848 -1.584719 0.533415
C  -3.373318 -0.241407 -1.413608
C  -6.613457 0.512642 0.367756
C  -5.185041 0.09258 0.281743
C  -7.0027 1.50144 1.26262
C  -7.624126 -0.109603 -0.352551
C  -8.318658 1.870561 1.437687
C  -8.955799 0.213835 -0.200933
C  -9.292098 1.211512 0.700812
H  3.938634 -1.220048 2.64197
H  6.259692 -2.977523 1.610887
H  5.277894 -3.236107 3.12126
H  6.023114 -0.959783 3.95833
H  6.997141 -0.741647 2.438591
H  5.887769 -0.266324 -1.722629
H  5.311278 1.390627 2.189169
H  7.037111 1.782155 -2.422699
H  6.453934 3.440789 1.490286
H  3.093234 -2.977056 -1.778394
H  2.556899 -4.124029 -0.553311
H  1.097113 -2.240984 -2.852099
H  1.179622 -2.380498 1.422481
H  -1.133178 -1.288186 -2.799775
H  -1.049353 -1.399614 1.492402
H  -2.910854 -0.754564 0.475055
H  -5.215741 0.54851 -1.702053
H  -8.575588 2.655436 2.135605
H  -9.711238 -0.307452 -0.772675
H  -10.330696 1.48142 0.831264
elementType: Cl F O N C H
totalener: -2014.65190809 hartree
nucrepener: 3250.69581987 hartree
electener: -5265.34772796 hartree
oneelecener: -9221.48455048 hartree
twoeener: 3956.13682252 hartree
cpcmener: -0.04868974 hartree
kineticenergy: 2007.63829370 hartree
xcener: -167.131219547941 hartree
chargesum: 0.0000000
charge: -0.096507 -0.204098 -0.208027 -0.235077 -0.521904 -0.468348 -0.167748 -0.170838 -0.151935 -0.095852 -0.172702 -0.185546 0.224404 0.040288 -0.203914 -0.233783 -0.155600 -0.144233 0.106259 0.125604 -0.036325 -0.166388 -0.195139 0.175142 -0.213032 -0.200100 0.432043 -0.129692 0.410276 0.304148 0.308415 -0.241685 -0.238823 -0.067967 0.119271 0.093975 0.097269 0.097280 0.102992 0.141091 0.161290 0.144647 0.144508 0.097948 0.109939 0.146127 0.141889 0.156336 0.144476 0.202808 0.196790 0.154557 0.155428 0.170061
qa: -0.0965 -0.2041 -0.2080 -0.2351 -0.5219 -0.4683 -0.1677 -0.1708 -0.1519 -0.0959 -0.1727 -0.1855 0.2244 0.0403 -0.2039 -0.2338 -0.1556 -0.1442 0.1063 0.1256 -0.0363 -0.1664 -0.1951 0.1751 -0.2130 -0.2001 0.4320 -0.1297 0.4103 0.3041 0.3084 -0.2417 -0.2388 -0.0680 0.1193 0.0940 0.0973 0.0973 0.1030 0.1411 0.1613 0.1446 0.1445 0.0979 0.1099 0.1461 0.1419 0.1563 0.1445 0.2028 0.1968 0.1546 0.1554 0.1701
va: 1.2092 1.0938 1.0865 1.9685 1.9835 2.0411 2.8972 3.2562 3.2174 3.8051 3.9113 3.9289 3.7389 3.6103 4.0242 3.9925 4.0070 3.9852 3.8339 3.7976 3.6765 3.9877 3.9851 3.8125 3.9630 3.9687 4.3023 3.5513 4.0712 3.9488 3.9275 3.9542 3.9544 3.8111 1.0048 1.0165 1.0154 1.0161 1.0072 1.0245 0.9924 1.0068 1.0063 1.0178 0.9928 1.0018 1.0140 1.0288 1.0075 1.0360 1.0063 1.0001 0.9995 0.9835
dispcorr: -0.024659651 hartree
energy: -2014.676567745157
dipole: 23.20357 -25.64175 -2.43819 -19.86815 19.62103 -0.24712 9.17566 -7.80775 1.36791
magnitude: 2.80660 au
magnitude: 7.13381 debye
