program: Orca
programVersion: 5.0.2
elementType: Cl F F O O O N N N C C C C C C C C C C C C C C C C C C C C C C C C C H H H H H H H H H H H H H H H H H H H H
charge: 0
multiplicity: 1
keywords: wb97x-d3
keywords: def2-TZVPP
keywords: def2/J RIJCOSX
keywords: DEFGRID2
keywords: scfconv7
keywords: smallprint printgap noloewdin
keywords: NOSOSCF
formula: C25H20ClF2N3O3
InChI: InChI=1/C25H20ClF2N3O3/c26-18-10-8-17(9-11-18)23(16-6-7-16)31-34-14-15-4-12-19(13-5-15)29-25(33)30-24(32)22-20(27)2-1-3-21(22)28/h1-5,8-13,16,29-30H,6-7,14H2
54 atoms
Cl 7.411023 4.336455 0.330456
F  -6.018929 2.702885 0.049628
F  -7.200347 -1.670846 -1.093501
O  3.559489 -2.65565 0.241025
O  -3.120107 0.170347 2.56396
O  -4.556906 -0.501079 -1.258086
N  4.073027 -1.411481 0.46811
N  -2.523889 -0.689793 0.532192
N  -4.637132 0.217349 0.903588
C  5.031844 -1.755988 -1.745627
C  6.358493 -1.765262 -2.437857
C  5.884683 -2.993889 -1.734312
C  4.816484 -0.998255 -0.484963
C  5.45345 0.31637 -0.276376
C  5.696911 1.161202 -1.358619
C  5.820788 0.745397 0.999422
C  6.288856 2.400819 -1.178609
C  6.420481 1.978383 1.193194
C  6.650362 2.798028 0.098798
C  2.639643 -3.006295 1.264719
C  1.302217 -2.348755 1.088358
C  0.558534 -2.558658 -0.071537
C  0.761571 -1.531104 2.069139
C  -1.241634 -1.193836 0.783578
C  -0.690826 -1.992605 -0.223692
C  -0.495577 -0.953401 1.934379
C  -3.363517 -0.101592 1.403353
C  -6.559139 0.498561 -0.512214
C  -5.15408 0.030211 -0.340184
C  -6.943995 1.820649 -0.33921
C  -7.539453 -0.389786 -0.935274
C  -8.231128 2.256939 -0.571469
C  -8.841783 -0.004437 -1.166926
C  -9.175399 1.329944 -0.985235
H  4.15451 -1.802578 -2.384008
H  7.17439 -1.213519 -1.987923
H  6.356479 -1.752137 -3.519875
H  5.547307 -3.837674 -2.321857
H  6.375409 -3.260873 -0.806832
H  5.419488 0.85867 -2.359691
H  5.656542 0.101979 1.853306
H  6.467078 3.045236 -2.028597
H  6.71355 2.289071 2.186887
H  2.544493 -4.090606 1.187462
H  3.057141 -2.778355 2.248699
H  0.950862 -3.184778 -0.864074
H  1.325792 -1.33662 2.97345
H  -1.258359 -2.181262 -1.12793
H  -0.867296 -0.324451 2.726127
H  -2.895959 -0.876338 -0.393785
H  -5.239495 0.632211 1.604152
H  -8.486519 3.298703 -0.434188
H  -9.577595 -0.731268 -1.482548
H  -10.190636 1.652809 -1.168927
elementType: Cl F O N C H
totalener: -2014.65233302 hartree
nucrepener: 3254.16179879 hartree
electener: -5268.81413181 hartree
oneelecener: -9228.50001763 hartree
twoeener: 3959.68588582 hartree
cpcmener: -0.04863115 hartree
kineticenergy: 2007.63927217 hartree
xcener: -167.130495713266 hartree
chargesum: -0.0000000
charge: -0.096574 -0.208096 -0.204781 -0.232324 -0.519564 -0.467058 -0.165198 -0.174984 -0.151115 -0.094808 -0.188577 -0.175164 0.220749 0.043442 -0.230462 -0.207055 -0.145627 -0.154682 0.105754 0.108867 -0.064940 -0.175022 -0.144675 0.188115 -0.207182 -0.228096 0.432526 -0.128510 0.409978 0.316010 0.299956 -0.245130 -0.242381 -0.065737 0.119310 0.103234 0.097802 0.098193 0.094129 0.161170 0.140830 0.144861 0.145006 0.115741 0.099947 0.144555 0.145921 0.144377 0.156682 0.202822 0.197440 0.155300 0.154621 0.170405
qa: -0.0966 -0.2081 -0.2048 -0.2323 -0.5196 -0.4671 -0.1652 -0.1750 -0.1511 -0.0948 -0.1886 -0.1752 0.2207 0.0434 -0.2305 -0.2071 -0.1456 -0.1547 0.1058 0.1089 -0.0649 -0.1750 -0.1447 0.1881 -0.2072 -0.2281 0.4325 -0.1285 0.4100 0.3160 0.3000 -0.2451 -0.2424 -0.0657 0.1193 0.1032 0.0978 0.0982 0.0941 0.1612 0.1408 0.1449 0.1450 0.1157 0.0999 0.1446 0.1459 0.1444 0.1567 0.2028 0.1974 0.1553 0.1546 0.1704
va: 1.2088 1.0865 1.0931 1.9589 1.9860 2.0427 2.8977 3.2558 3.2178 3.8085 3.9253 3.9101 3.7392 3.6085 3.9892 4.0264 3.9866 4.0031 3.8319 3.8111 3.6766 3.9716 3.9602 3.7979 3.9655 3.9772 4.3024 3.5480 4.0675 3.9270 3.9509 3.9570 3.9556 3.8060 1.0057 1.0074 1.0159 1.0149 1.0165 0.9920 1.0255 1.0062 1.0065 0.9940 1.0116 1.0092 1.0024 1.0073 1.0288 1.0365 1.0059 0.9999 1.0000 0.9833
dispcorr: -0.024572791 hartree
energy: -2014.676905812833
dipole: 24.29463 -26.66768 -2.37305 -21.63673 21.25328 -0.38346 -4.99764 3.73284 -1.26481
magnitude: 2.71627 au
magnitude: 6.90422 debye
