program: Orca
programVersion: 5.0.2
elementType: Cl F F O O O N N N C C C C C C C C C C C C C C C C C C C C C C C C C H H H H H H H H H H H H H H H H H H H H
charge: 0
multiplicity: 1
keywords: wb97x-d3
keywords: def2-TZVPP
keywords: def2/J RIJCOSX
keywords: DEFGRID2
keywords: scfconv7
keywords: smallprint printgap noloewdin
keywords: NOSOSCF
formula: C25H20ClF2N3O3
InChI: InChI=1/C25H20ClF2N3O3/c26-18-10-8-17(9-11-18)23(16-6-7-16)31-34-14-15-4-12-19(13-5-15)29-25(33)30-24(32)22-20(27)2-1-3-21(22)28/h1-5,8-13,16,29-30H,6-7,14H2
54 atoms
Cl 6.152538 4.738657 -0.503556
F  -6.824016 -0.927719 1.913432
F  -5.665568 2.335084 -1.231045
O  3.771598 -2.848344 0.125293
O  -3.121771 -0.998303 -2.70121
O  -4.171968 -0.154744 1.207972
N  4.070828 -1.558553 -0.202545
N  -2.34603 -1.10265 -0.553452
N  -4.470689 -0.292461 -1.045625
C  5.258583 -1.632604 1.922507
C  6.253138 -2.756536 1.8681
C  6.64558 -1.439463 2.452038
C  4.811704 -0.981278 0.663079
C  5.170185 0.419435 0.365086
C  5.205403 0.895162 -0.947234
C  5.448906 1.310229 1.400728
C  5.504039 2.218456 -1.220044
C  5.74646 2.638978 1.142233
C  5.772239 3.082927 -0.169175
C  2.874195 -3.397391 -0.823861
C  1.511431 -2.767771 -0.775757
C  0.897247 -2.464812 0.43731
C  0.81464 -2.495448 -1.943336
C  -1.069643 -1.654654 -0.711293
C  -0.368219 -1.913343 0.469584
C  -0.463608 -1.951015 -1.92943
C  -3.255319 -0.826009 -1.50335
C  -6.197267 0.669235 0.323087
C  -4.850635 0.043084 0.216535
C  -7.134861 0.168835 1.219666
C  -6.556994 1.808662 -0.38564
C  -8.374815 0.743596 1.39519
C  -7.779447 2.426858 -0.233025
C  -8.685885 1.879541 0.661903
H  4.471602 -1.739761 2.663598
H  6.666381 -3.0184 0.902365
H  6.095302 -3.598051 2.529739
H  6.763166 -1.360138 3.524743
H  7.328566 -0.822398 1.881781
H  5.007888 0.225303 -1.772733
H  5.427078 0.9765 2.429285
H  5.532538 2.567359 -2.243279
H  5.955418 3.315318 1.959643
H  3.290756 -3.331851 -1.833448
H  2.818153 -4.455758 -0.561212
H  1.404562 -2.658549 1.374318
H  1.273808 -2.708969 -2.901354
H  -0.825482 -1.683491 1.424888
H  -0.956273 -1.759817 -2.867849
H  -2.627961 -0.910432 0.403222
H  -5.132013 -0.132101 -1.795048
H  -9.081736 0.313021 2.091074
H  -8.014189 3.318391 -0.798128
H  -9.651562 2.347658 0.792349
elementType: Cl F O N C H
totalener: -2014.65217515 hartree
nucrepener: 3283.23473219 hartree
electener: -5297.88690734 hartree
oneelecener: -9286.72832335 hartree
twoeener: 3988.84141601 hartree
cpcmener: -0.04864915 hartree
kineticenergy: 2007.65090821 hartree
xcener: -167.135709027852 hartree
chargesum: 0.0000000
charge: -0.096594 -0.203515 -0.208117 -0.232160 -0.523356 -0.469168 -0.167214 -0.170660 -0.150787 -0.087327 -0.175837 -0.194031 0.224578 0.033990 -0.208309 -0.223893 -0.151008 -0.151310 0.106125 0.113192 -0.029697 -0.196246 -0.162815 0.178835 -0.203979 -0.218784 0.431525 -0.125559 0.413041 0.299972 0.309621 -0.240176 -0.240886 -0.065308 0.122274 0.092835 0.097951 0.098231 0.105129 0.138918 0.163952 0.145329 0.144843 0.100353 0.110215 0.141926 0.145255 0.144690 0.157043 0.203604 0.194139 0.154359 0.154770 0.170041
qa: -0.0966 -0.2035 -0.2081 -0.2322 -0.5234 -0.4692 -0.1672 -0.1707 -0.1508 -0.0873 -0.1758 -0.1940 0.2246 0.0340 -0.2083 -0.2239 -0.1510 -0.1513 0.1061 0.1132 -0.0297 -0.1962 -0.1628 0.1788 -0.2040 -0.2188 0.4315 -0.1256 0.4130 0.3000 0.3096 -0.2402 -0.2409 -0.0653 0.1223 0.0928 0.0980 0.0982 0.1051 0.1389 0.1640 0.1453 0.1448 0.1004 0.1102 0.1419 0.1453 0.1447 0.1570 0.2036 0.1941 0.1544 0.1548 0.1700
va: 1.2090 1.0942 1.0867 1.9674 1.9826 2.0398 2.9011 3.2596 3.2225 3.8041 3.9146 3.9240 3.7307 3.6331 4.0267 3.9904 4.0023 3.9966 3.8321 3.8197 3.6575 3.9775 3.9868 3.8173 3.9594 3.9644 4.3034 3.5458 4.0631 3.9516 3.9251 3.9525 3.9562 3.8109 1.0035 1.0174 1.0150 1.0160 1.0075 1.0289 0.9908 1.0066 1.0065 1.0104 0.9931 1.0138 1.0018 1.0074 1.0305 1.0360 1.0085 1.0000 0.9999 0.9835
dispcorr: -0.024739724 hartree
energy: -2014.676914870572
dipole: 27.45952 -29.45875 -1.99923 -21.99688 22.03928 0.04240 6.70637 -5.45367 1.25270
magnitude: 2.35966 au
magnitude: 5.99778 debye
