program: Orca
programVersion: 5.0.2
elementType: Cl F F O O O N N N C C C C C C C C C C C C C C C C C C C C C C C C C H H H H H H H H H H H H H H H H H H H H
charge: 0
multiplicity: 1
keywords: wb97x-d3
keywords: def2-TZVPP
keywords: def2/J RIJCOSX
keywords: DEFGRID2
keywords: scfconv7
keywords: smallprint printgap noloewdin
keywords: NOSOSCF
formula: C25H20ClF2N3O3
InChI: InChI=1/C25H20ClF2N3O3/c26-18-10-8-17(9-11-18)23(16-6-7-16)31-34-14-15-4-12-19(13-5-15)29-25(33)30-24(32)22-20(27)2-1-3-21(22)28/h1-5,8-13,16,29-30H,6-7,14H2
54 atoms
Cl 6.500136 4.548009 -0.118297
F  -6.407732 1.061163 -1.887122
F  -6.080156 -0.17588 2.6058
O  3.805137 -2.948561 -0.498359
O  -1.912842 1.241171 -1.215196
O  -4.697168 -1.395819 0.341866
N  4.140627 -1.63513 -0.635517
N  -2.207796 -0.951818 -0.650491
N  -3.912241 0.614112 -0.393325
C  5.161849 -1.970635 1.556059
C  5.077746 -1.380055 2.92885
C  4.08673 -2.414649 2.505644
C  4.791277 -1.170426 0.359606
C  5.196228 0.244879 0.24915
C  6.380336 0.683787 0.83904
C  4.422033 1.165201 -0.458551
C  6.79181 2.00168 0.722451
C  4.816572 2.487202 -0.575589
C  6.00269 2.894706 0.016066
C  2.901821 -3.328496 -1.533691
C  1.549912 -2.706479 -1.349901
C  0.638019 -3.244156 -0.445505
C  1.190521 -1.550226 -2.031645
C  -0.934308 -1.475083 -0.911793
C  -0.586697 -2.641064 -0.228073
C  -0.036553 -0.934354 -1.82964
C  -2.595956 0.328722 -0.788177
C  -6.186286 0.438587 0.353239
C  -4.870647 -0.215734 0.100475
C  -6.923189 1.045161 -0.654575
C  -6.762502 0.404136 1.616718
C  -8.164146 1.604567 -0.437377
C  -7.992315 0.964484 1.886918
C  -8.687357 1.562737 0.845952
H  5.962529 -2.684183 1.385936
H  4.727158 -0.359767 3.02317
H  5.845751 -1.654651 3.639793
H  4.162526 -3.41215 2.918104
H  3.073484 -2.086801 2.309534
H  7.001812 -0.007665 1.392481
H  3.489342 0.855593 -0.911358
H  7.71758 2.323053 1.179631
H  4.199324 3.190823 -1.117504
H  3.320744 -3.074271 -2.510628
H  2.844073 -4.415012 -1.461704
H  0.883316 -4.149218 0.097444
H  1.875864 -1.117927 -2.750281
H  -1.282476 -3.075497 0.480442
H  -0.279058 -0.053264 -2.402055
H  -2.864615 -1.577451 -0.194867
H  -4.150921 1.592073 -0.504067
H  -8.709363 2.057799 -1.253783
H  -8.397205 0.934069 2.889125
H  -9.656055 2.00233 1.038585
elementType: Cl F O N C H
totalener: -2014.65198617 hartree
nucrepener: 3320.08440576 hartree
electener: -5334.73639193 hartree
oneelecener: -9360.43136100 hartree
twoeener: 4025.69496907 hartree
cpcmener: -0.04852500 hartree
kineticenergy: 2007.64921217 hartree
xcener: -167.131911961646 hartree
chargesum: -0.0000000
charge: -0.097079 -0.208145 -0.204154 -0.235380 -0.521324 -0.466542 -0.149720 -0.185960 -0.153468 -0.084174 -0.187215 -0.180120 0.210767 0.031432 -0.218615 -0.209439 -0.149164 -0.155993 0.109305 0.092282 -0.056328 -0.171997 -0.153262 0.196705 -0.202491 -0.216762 0.434451 -0.127147 0.409568 0.312993 0.301400 -0.243249 -0.243348 -0.065545 0.119476 0.102142 0.096573 0.098554 0.091627 0.159642 0.148953 0.144295 0.143378 0.102272 0.113046 0.146468 0.143192 0.145240 0.150056 0.204841 0.198296 0.154949 0.154489 0.170228
qa: -0.0971 -0.2081 -0.2042 -0.2354 -0.5213 -0.4665 -0.1497 -0.1860 -0.1535 -0.0842 -0.1872 -0.1801 0.2108 0.0314 -0.2186 -0.2094 -0.1492 -0.1560 0.1093 0.0923 -0.0563 -0.1720 -0.1533 0.1967 -0.2025 -0.2168 0.4345 -0.1271 0.4096 0.3130 0.3014 -0.2432 -0.2433 -0.0655 0.1195 0.1021 0.0966 0.0986 0.0916 0.1596 0.1490 0.1443 0.1434 0.1023 0.1130 0.1465 0.1432 0.1452 0.1501 0.2048 0.1983 0.1549 0.1545 0.1702
va: 1.2083 1.0863 1.0940 1.9585 1.9834 2.0409 2.9045 3.2390 3.2108 3.7947 3.9236 3.9152 3.7649 3.5992 3.9881 4.0278 3.9908 4.0162 3.8205 3.8405 3.6280 3.9604 3.9334 3.7398 3.9815 4.0020 4.3059 3.5457 4.0718 3.9259 3.9535 3.9583 3.9551 3.8073 1.0039 1.0073 1.0162 1.0142 1.0165 0.9932 1.0075 1.0064 1.0078 1.0095 0.9958 1.0023 1.0113 1.0066 1.0248 1.0351 1.0049 0.9999 1.0002 0.9834
dispcorr: -0.025677609 hartree
energy: -2014.677663782441
dipole: 21.21292 -23.61010 -2.39718 -20.76463 20.48361 -0.28102 6.12906 -4.99356 1.13550
magnitude: 2.66736 au
magnitude: 6.77988 debye
