program: Orca
programVersion: 5.0.2
elementType: Cl F F O O O N N N C C C C C C C C C C C C C C C C C C C C C C C C C H H H H H H H H H H H H H H H H H H H H
charge: 0
multiplicity: 1
keywords: wb97x-d3
keywords: def2-TZVPP
keywords: def2/J RIJCOSX
keywords: DEFGRID2
keywords: scfconv7
keywords: smallprint printgap noloewdin
keywords: NOSOSCF
formula: C25H20ClF2N3O3
InChI: InChI=1/C25H20ClF2N3O3/c26-18-10-8-17(9-11-18)23(16-6-7-16)31-34-14-15-4-12-19(13-5-15)29-25(33)30-24(32)22-20(27)2-1-3-21(22)28/h1-5,8-13,16,29-30H,6-7,14H2
54 atoms
Cl 5.134417 4.912219 -0.71383
F  -5.219793 0.900292 2.350976
F  -6.21831 1.077535 -2.204051
O  4.018439 -2.966092 -0.276662
O  -3.216956 -2.863825 0.954748
O  -3.599203 0.747163 -1.022458
N  4.096373 -1.632808 -0.547387
N  -2.100466 -1.415622 -0.416391
N  -4.259769 -0.971397 0.320232
C  5.54705 -1.614355 1.411503
C  5.703574 -0.912303 2.723201
C  4.773842 -2.075975 2.615873
C  4.817524 -0.983535 0.281587
C  4.893092 0.471462 0.042701
C  3.799977 1.166333 -0.476255
C  6.061162 1.178609 0.322111
C  3.867466 2.529013 -0.712262
C  6.145472 2.540879 0.083374
C  5.043807 3.206232 -0.430521
C  3.11296 -3.586924 -1.189174
C  1.71054 -3.087701 -1.0137
C  0.898787 -3.574677 0.003253
C  1.211316 -2.065205 -1.814964
C  -0.858925 -2.04085 -0.575257
C  -0.373879 -3.069761 0.230601
C  -0.052709 -1.548773 -1.603382
C  -3.149782 -1.83123 0.314237
C  -5.683966 0.946913 0.06394
C  -4.41235 0.245995 -0.267525
C  -6.039495 1.273319 1.364828
C  -6.533879 1.381458 -0.944681
C  -7.183004 1.980533 1.670112
C  -7.690974 2.084808 -0.690516
C  -8.005949 2.380001 0.628077
H  6.36524 -2.260153 1.107692
H  5.264698 0.071483 2.832205
H  6.639627 -1.04275 3.249949
H  5.059888 -3.018606 3.063408
H  3.710562 -1.873205 2.639075
H  2.875199 0.644336 -0.683947
H  6.925126 0.666167 0.724315
H  3.007089 3.054844 -1.103289
H  7.06199 3.073125 0.298119
H  3.454138 -3.43594 -2.216766
H  3.184194 -4.650856 -0.961988
H  1.260736 -4.36993 0.644252
H  1.816613 -1.663127 -2.617469
H  -0.957935 -3.475125 1.04032
H  -0.41884 -0.750388 -2.238773
H  -2.234604 -0.558019 -0.943856
H  -5.028684 -1.324222 0.877147
H  -7.421079 2.216986 2.698097
H  -8.33186 2.393162 -1.505015
H  -8.908663 2.933274 0.846464
elementType: Cl F O N C H
totalener: -2014.65144350 hartree
nucrepener: 3341.28529456 hartree
electener: -5355.93673806 hartree
oneelecener: -9402.64663530 hartree
twoeener: 4046.70989723 hartree
cpcmener: -0.04781957 hartree
kineticenergy: 2007.66669945 hartree
xcener: -167.136106324134 hartree
chargesum: 0.0000000
charge: -0.096921 -0.208105 -0.203727 -0.236387 -0.520788 -0.466518 -0.150036 -0.175530 -0.152589 -0.096497 -0.186611 -0.173340 0.205853 0.053108 -0.211115 -0.231542 -0.155271 -0.141422 0.105437 0.085653 -0.055836 -0.169562 -0.161467 0.197776 -0.208266 -0.213877 0.431513 -0.127723 0.410344 0.308904 0.305210 -0.241483 -0.244243 -0.065140 0.116987 0.102971 0.097012 0.098625 0.091964 0.152483 0.159051 0.143433 0.144350 0.103462 0.111940 0.145400 0.141985 0.155404 0.142959 0.203985 0.197583 0.155030 0.155067 0.170508
qa: -0.0969 -0.2081 -0.2037 -0.2364 -0.5208 -0.4665 -0.1500 -0.1755 -0.1526 -0.0965 -0.1866 -0.1733 0.2059 0.0531 -0.2111 -0.2315 -0.1553 -0.1414 0.1054 0.0857 -0.0558 -0.1696 -0.1615 0.1978 -0.2083 -0.2139 0.4315 -0.1277 0.4103 0.3089 0.3052 -0.2415 -0.2442 -0.0651 0.1170 0.1030 0.0970 0.0986 0.0920 0.1525 0.1591 0.1434 0.1444 0.1035 0.1119 0.1454 0.1420 0.1554 0.1430 0.2040 0.1976 0.1550 0.1551 0.1705
va: 1.2086 1.0867 1.0943 1.9566 1.9843 2.0421 2.9014 3.2501 3.2153 3.8038 3.9245 3.9086 3.7707 3.5649 4.0236 3.9893 4.0135 3.9798 3.8264 3.8520 3.6236 3.9889 3.9177 3.7707 3.9643 3.9647 4.3058 3.5464 4.0695 3.9274 3.9488 3.9567 3.9564 3.8084 1.0063 1.0070 1.0161 1.0143 1.0169 1.0027 0.9934 1.0076 1.0061 1.0055 0.9958 1.0043 1.0119 1.0258 1.0079 1.0369 1.0057 0.9997 1.0001 0.9833
dispcorr: -0.025685522 hartree
energy: -2014.677129025825
dipole: 25.43476 -27.18874 -1.75398 -21.08173 21.72241 0.64068 8.23788 -7.43235 0.80552
magnitude: 2.03367 au
magnitude: 5.16917 debye
