program: Orca
programVersion: 5.0.2
elementType: Cl F F O O O N N N C C C C C C C C C C C C C C C C C C C C C C C C C H H H H H H H H H H H H H H H H H H H H
charge: 0
multiplicity: 1
keywords: wb97x-d3
keywords: def2-TZVPP
keywords: def2/J RIJCOSX
keywords: DEFGRID2
keywords: scfconv7
keywords: smallprint printgap noloewdin
keywords: NOSOSCF
formula: C25H20ClF2N3O3
InChI: InChI=1/C25H20ClF2N3O3/c26-18-10-8-17(9-11-18)23(16-6-7-16)31-34-14-15-4-12-19(13-5-15)29-25(33)30-24(32)22-20(27)2-1-3-21(22)28/h1-5,8-13,16,29-30H,6-7,14H2
54 atoms
Cl 7.697379 4.173075 0.314131
F  -6.287134 1.700173 1.650098
F  -6.939924 -1.033075 -2.079352
O  3.665369 -2.69599 0.470909
O  -2.075635 1.444529 -0.030994
O  -5.033648 -1.44338 0.100228
N  4.23088 -1.467611 0.631159
N  -2.422908 -0.778345 0.366441
N  -4.181479 0.6557 -0.147333
C  5.067585 -1.880489 -1.62218
C  3.878348 -2.085942 -2.515193
C  5.012621 -1.224429 -2.966145
C  4.908685 -1.081371 -0.37973
C  5.575583 0.227377 -0.229962
C  5.036834 1.221321 0.588565
C  6.77948 0.48438 -0.883515
C  5.682878 2.433194 0.758972
C  7.441026 1.690822 -0.716094
C  6.884962 2.657966 0.105243
C  2.728614 -2.950167 1.514471
C  1.38454 -2.348055 1.225781
C  1.154976 -0.981396 1.35711
C  0.329261 -3.147815 0.799885
C  -1.125772 -1.231282 0.63721
C  -0.078132 -0.417326 1.067227
C  -0.909335 -2.602949 0.512804
C  -2.805118 0.475147 0.064453
C  -6.562999 0.321594 -0.215579
C  -5.193832 -0.248556 -0.067641
C  -7.081657 1.251475 0.674393
C  -7.419187 -0.147433 -1.203046
C  -8.381842 1.704031 0.604772
C  -8.722855 0.283421 -1.320975
C  -9.195728 1.210892 -0.403411
H  5.736654 -2.730349 -1.526183
H  2.952716 -1.594289 -2.243177
H  3.750945 -3.061365 -2.965842
H  5.676829 -1.599514 -3.733541
H  4.846257 -0.155056 -3.003939
H  4.093963 1.055922 1.092706
H  7.222382 -0.26606 -1.524847
H  5.247674 3.194899 1.39139
H  8.379605 1.868543 -1.223068
H  2.649913 -4.036332 1.571866
H  3.130694 -2.589759 2.464099
H  1.948048 -0.332149 1.706778
H  0.470902 -4.216592 0.693993
H  -0.21024 0.643859 1.203549
H  -1.718102 -3.247768 0.190027
H  -3.143046 -1.492438 0.319986
H  -4.426368 1.616641 -0.354106
H  -8.749936 2.419845 1.326873
H  -9.354927 -0.097999 -2.1111
H  -10.218256 1.554275 -0.474669
elementType: Cl F O N C H
totalener: -2014.65090597 hartree
nucrepener: 3285.45458558 hartree
electener: -5300.10549155 hartree
oneelecener: -9290.98881612 hartree
twoeener: 3990.88332457 hartree
cpcmener: -0.04828635 hartree
kineticenergy: 2007.65567031 hartree
xcener: -167.133611490037 hartree
chargesum: -0.0000000
charge: -0.097106 -0.208377 -0.204791 -0.233826 -0.520404 -0.466157 -0.153666 -0.180085 -0.153510 -0.083381 -0.179244 -0.192398 0.196180 0.036394 -0.212378 -0.216366 -0.160947 -0.149536 0.110130 0.103072 -0.088439 -0.140312 -0.143944 0.195004 -0.233577 -0.210592 0.431795 -0.127686 0.409181 0.307326 0.306746 -0.239712 -0.243610 -0.068502 0.119408 0.090224 0.098632 0.097342 0.104009 0.159804 0.160271 0.142860 0.144702 0.107238 0.102625 0.159889 0.145570 0.150959 0.145601 0.204381 0.199001 0.155063 0.154889 0.170252
qa: -0.0971 -0.2084 -0.2048 -0.2338 -0.5204 -0.4662 -0.1537 -0.1801 -0.1535 -0.0834 -0.1792 -0.1924 0.1962 0.0364 -0.2124 -0.2164 -0.1609 -0.1495 0.1101 0.1031 -0.0884 -0.1403 -0.1439 0.1950 -0.2336 -0.2106 0.4318 -0.1277 0.4092 0.3073 0.3067 -0.2397 -0.2436 -0.0685 0.1194 0.0902 0.0986 0.0973 0.1040 0.1598 0.1603 0.1429 0.1447 0.1072 0.1026 0.1599 0.1456 0.1510 0.1456 0.2044 0.1990 0.1551 0.1549 0.1703
va: 1.2082 1.0860 1.0932 1.9630 1.9843 2.0425 2.8975 3.2425 3.2120 3.7991 3.9162 3.9231 3.7684 3.5988 4.0226 3.9871 4.0279 3.9886 3.8191 3.8118 3.6751 3.9197 3.9660 3.7593 4.0298 3.9763 4.3074 3.5431 4.0747 3.9299 3.9471 3.9552 3.9551 3.8095 1.0039 1.0170 1.0142 1.0163 1.0071 0.9986 0.9927 1.0084 1.0062 0.9989 1.0156 1.0095 1.0004 1.0284 1.0067 1.0361 1.0045 0.9995 0.9999 0.9834
dispcorr: -0.025461948 hartree
energy: -2014.676367918547
dipole: 18.87262 -21.61754 -2.74493 -18.69901 18.30825 -0.39076 -6.27756 5.57914 -0.69842
magnitude: 2.85921 au
magnitude: 7.26755 debye
