program: Orca
programVersion: 5.0.2
elementType: Cl F F O O O N N N C C C C C C C C C C C C C C C C C C C C C C C C C H H H H H H H H H H H H H H H H H H H H
charge: 0
multiplicity: 1
keywords: wb97x-d3
keywords: def2-TZVPP
keywords: def2/J RIJCOSX
keywords: DEFGRID2
keywords: scfconv7
keywords: smallprint printgap noloewdin
keywords: NOSOSCF
formula: C25H20ClF2N3O3
InChI: InChI=1/C25H20ClF2N3O3/c26-18-10-8-17(9-11-18)23(16-6-7-16)31-34-14-15-4-12-19(13-5-15)29-25(33)30-24(32)22-20(27)2-1-3-21(22)28/h1-5,8-13,16,29-30H,6-7,14H2
54 atoms
Cl 7.507218 4.199774 -1.324106
F  -5.884669 2.346655 1.415196
F  -7.266175 -1.151241 -1.349345
O  3.718321 -2.726954 -0.246917
O  -2.754393 -1.007906 2.162104
O  -4.651182 0.146062 -1.329356
N  4.192131 -1.499504 -0.61464
N  -2.420616 -0.78085 -0.087709
N  -4.448511 -0.220891 0.910966
C  5.361785 -1.678954 1.515883
C  5.590174 -0.892983 2.768325
C  4.349567 -1.711814 2.627474
C  4.999362 -1.004133 0.24215
C  5.593984 0.297068 -0.119903
C  4.886275 1.232748 -0.874284
C  6.900812 0.597211 0.261322
C  5.466291 2.434662 -1.243858
C  7.497068 1.791245 -0.109984
C  6.772203 2.70157 -0.861944
C  2.67799 -3.135863 -1.115333
C  1.370416 -2.45901 -0.815969
C  0.513242 -2.083001 -1.84335
C  0.957757 -2.233516 0.492099
C  -1.142108 -1.327841 -0.25587
C  -0.726516 -1.532115 -1.572004
C  -0.275026 -1.668511 0.781851
C  -3.135818 -0.699783 1.048102
C  -6.531011 0.581402 0.029369
C  -5.121032 0.159615 -0.206872
C  -6.870137 1.675481 0.81152
C  -7.570703 -0.089434 -0.599983
C  -8.172741 2.098726 0.970631
C  -8.889413 0.283088 -0.456511
C  -9.177805 1.38823 0.331631
H  5.954394 -2.580588 1.395705
H  5.487456 0.183882 2.722573
H  6.36648 -1.238372 3.438169
H  4.256685 -2.628095 3.195434
H  3.416345 -1.184563 2.472064
H  3.864592 1.032215 -1.167691
H  7.47408 -0.110404 0.845461
H  4.901147 3.15488 -1.819592
H  8.515672 2.00307 0.18496
H  2.962328 -2.981945 -2.160013
H  2.591003 -4.212775 -0.955547
H  0.809774 -2.229079 -2.875131
H  1.600022 -2.504688 1.320947
H  -1.380205 -1.259811 -2.392023
H  -0.539779 -1.506465 1.813098
H  -2.901219 -0.509975 -0.940334
H  -4.952741 -0.202675 1.789292
H  -8.395294 2.964964 1.578323
H  -9.672288 -0.276389 -0.949857
H  -10.205813 1.700967 0.449797
elementType: Cl F O N C H
totalener: -2014.65187567 hartree
nucrepener: 3276.21844357 hartree
electener: -5290.87031924 hartree
oneelecener: -9272.43305570 hartree
twoeener: 3981.56273646 hartree
cpcmener: -0.04787478 hartree
kineticenergy: 2007.65528917 hartree
xcener: -167.134830210101 hartree
chargesum: -0.0000000
charge: -0.096929 -0.208146 -0.204893 -0.232850 -0.521706 -0.466961 -0.164082 -0.173396 -0.149711 -0.071515 -0.186391 -0.192590 0.215795 0.036087 -0.213592 -0.217311 -0.154286 -0.151321 0.108006 0.113257 -0.035225 -0.160456 -0.214000 0.174852 -0.201824 -0.208889 0.431981 -0.128985 0.409725 0.316981 0.299547 -0.244884 -0.243372 -0.066484 0.115693 0.104065 0.097874 0.100951 0.095026 0.140320 0.160527 0.145206 0.144742 0.098337 0.110316 0.145585 0.163636 0.145220 0.155103 0.202616 0.198259 0.155051 0.154948 0.170095
qa: -0.0969 -0.2081 -0.2049 -0.2329 -0.5217 -0.4670 -0.1641 -0.1734 -0.1497 -0.0715 -0.1864 -0.1926 0.2158 0.0361 -0.2136 -0.2173 -0.1543 -0.1513 0.1080 0.1133 -0.0352 -0.1605 -0.2140 0.1749 -0.2018 -0.2089 0.4320 -0.1290 0.4097 0.3170 0.2995 -0.2449 -0.2434 -0.0665 0.1157 0.1041 0.0979 0.1010 0.0950 0.1403 0.1605 0.1452 0.1447 0.0983 0.1103 0.1456 0.1636 0.1452 0.1551 0.2026 0.1983 0.1551 0.1549 0.1701
va: 1.2086 1.0865 1.0931 1.9669 1.9833 2.0430 2.9154 3.2552 3.2174 3.7995 3.9320 3.9108 3.7463 3.5960 4.0330 3.9803 4.0028 3.9942 3.8295 3.8155 3.6770 3.9672 3.9998 3.8175 3.9493 3.9890 4.3026 3.5460 4.0678 3.9274 3.9530 3.9582 3.9572 3.8067 1.0071 1.0067 1.0162 1.0138 1.0140 1.0227 0.9928 1.0063 1.0065 1.0176 0.9920 0.9995 0.9976 1.0066 1.0331 1.0364 1.0050 0.9999 0.9997 0.9834
dispcorr: -0.025404082 hartree
energy: -2014.677279752608
dipole: 20.81374 -23.23635 -2.42261 -18.53807 18.43105 -0.10702 9.30041 -8.69602 0.60439
magnitude: 2.49915 au
magnitude: 6.35235 debye
