program: Orca
programVersion: 5.0.2
elementType: Cl F F O O O N N N C C C C C C C C C C C C C C C C C C C C C C C C C H H H H H H H H H H H H H H H H H H H H
charge: 0
multiplicity: 1
keywords: wb97x-d3
keywords: def2-TZVPP
keywords: def2/J RIJCOSX
keywords: DEFGRID2
keywords: scfconv7
keywords: smallprint printgap noloewdin
keywords: NOSOSCF
formula: C25H20ClF2N3O3
InChI: InChI=1/C25H20ClF2N3O3/c26-18-10-8-17(9-11-18)23(16-6-7-16)31-34-14-15-4-12-19(13-5-15)29-25(33)30-24(32)22-20(27)2-1-3-21(22)28/h1-5,8-13,16,29-30H,6-7,14H2
54 atoms
Cl 7.400771 4.194312 1.087938
F  -5.919094 2.332265 1.073861
F  -6.956649 -1.185092 -1.823084
O  3.711989 -2.759274 -0.154888
O  -3.190484 -0.870201 2.660309
O  -4.319033 -0.164068 -1.256756
N  4.198259 -1.554241 0.266798
N  -2.403487 -0.923717 0.515428
N  -4.577398 -0.244603 1.004981
C  5.144303 -1.534457 -1.976149
C  4.032038 -1.499636 -2.988264
C  5.249465 -0.657727 -3.183995
C  4.898616 -0.966545 -0.62514
C  5.490449 0.324157 -0.223946
C  4.839542 1.170445 0.673872
C  6.738324 0.705233 -0.715034
C  5.418576 2.361481 1.078071
C  7.333353 1.889708 -0.312404
C  6.666548 2.709252 0.583866
C  2.790725 -3.279353 0.786544
C  1.453851 -2.594726 0.740574
C  0.762828 -2.305121 1.907796
C  0.844919 -2.280392 -0.472561
C  -1.119332 -1.459321 0.674103
C  -0.509862 -1.747247 1.892799
C  -0.416034 -1.717982 -0.505847
C  -3.331708 -0.703189 1.462783
C  -6.383273 0.552961 -0.368484
C  -4.99623 0.018346 -0.26181
C  -6.793391 1.711669 0.277125
C  -7.309565 -0.055428 -1.207321
C  -8.048207 2.256843 0.107517
C  -8.579373 0.444393 -1.399219
C  -8.936815 1.61017 -0.737348
H  5.748824 -2.436137 -1.980628
H  3.114616 -0.996539 -2.708571
H  3.891198 -2.373918 -3.609902
H  5.961194 -0.946053 -3.946204
H  5.145884 0.412011 -3.053044
H  3.86192 0.908142 1.0552
H  7.26656 0.069112 -1.412795
H  4.896733 3.011239 1.767357
H  8.306372 2.164644 -0.695763
H  2.684976 -4.331252 0.51266
H  3.207321 -3.244354 1.797257
H  1.219422 -2.521729 2.8664
H  1.348542 -2.483138 -1.409901
H  -0.997706 -1.544592 2.831349
H  -0.87141 -1.487355 -1.461859
H  -2.693408 -0.754736 -0.442936
H  -5.240774 -0.103315 1.756692
H  -8.320991 3.168675 0.620869
H  -9.27328 -0.066217 -2.05274
H  -9.926388 2.020529 -0.882257
elementType: Cl F O N C H
totalener: -2014.65219581 hartree
nucrepener: 3278.83665116 hartree
electener: -5293.48884697 hartree
oneelecener: -9277.59504626 hartree
twoeener: 3984.10619929 hartree
cpcmener: -0.04797732 hartree
kineticenergy: 2007.64204674 hartree
xcener: -167.132656878986 hartree
chargesum: -0.0000000
charge: -0.096799 -0.208135 -0.204018 -0.231651 -0.522171 -0.469712 -0.165812 -0.171099 -0.150196 -0.075174 -0.188070 -0.187508 0.216983 0.041161 -0.214309 -0.221680 -0.153468 -0.148923 0.106943 0.111246 -0.037656 -0.162293 -0.203793 0.177155 -0.216799 -0.199372 0.431101 -0.125404 0.412193 0.309789 0.300637 -0.241105 -0.241254 -0.066509 0.114573 0.094120 0.100322 0.097771 0.104388 0.140180 0.161444 0.145539 0.144493 0.110793 0.098829 0.145225 0.158419 0.156941 0.143746 0.203338 0.195158 0.155542 0.154397 0.170484
qa: -0.0968 -0.2081 -0.2040 -0.2317 -0.5222 -0.4697 -0.1658 -0.1711 -0.1502 -0.0752 -0.1881 -0.1875 0.2170 0.0412 -0.2143 -0.2217 -0.1535 -0.1489 0.1069 0.1112 -0.0377 -0.1623 -0.2038 0.1772 -0.2168 -0.1994 0.4311 -0.1254 0.4122 0.3098 0.3006 -0.2411 -0.2413 -0.0665 0.1146 0.0941 0.1003 0.0978 0.1044 0.1402 0.1614 0.1455 0.1445 0.1108 0.0988 0.1452 0.1584 0.1569 0.1437 0.2033 0.1952 0.1555 0.1544 0.1705
va: 1.2088 1.0866 1.0938 1.9662 1.9836 2.0396 2.9157 3.2588 3.2214 3.8042 3.9085 3.9322 3.7489 3.5888 4.0339 3.9821 4.0014 3.9930 3.8309 3.8146 3.6718 3.9835 3.9807 3.8251 3.9609 3.9732 4.3035 3.5455 4.0660 3.9251 3.9510 3.9576 3.9527 3.8108 1.0079 1.0147 1.0140 1.0162 1.0065 1.0223 0.9924 1.0063 1.0065 0.9924 1.0162 1.0013 0.9988 1.0301 1.0090 1.0354 1.0076 0.9996 1.0001 0.9834
dispcorr: -0.025301665 hartree
energy: -2014.677497474627
dipole: 20.04493 -22.40830 -2.36337 -17.56697 17.66689 0.09993 -10.58105 9.13664 -1.44441
magnitude: 2.77161 au
magnitude: 7.04487 debye
