program: Orca
programVersion: 5.0.2
elementType: Cl F F O O O N N N C C C C C C C C C C C C C C C C C C C C C C C C C H H H H H H H H H H H H H H H H H H H H
charge: 0
multiplicity: 1
keywords: wb97x-d3
keywords: def2-TZVPP
keywords: def2/J RIJCOSX
keywords: DEFGRID2
keywords: scfconv7
keywords: smallprint printgap noloewdin
keywords: NOSOSCF
formula: C25H20ClF2N3O3
InChI: InChI=1/C25H20ClF2N3O3/c26-18-10-8-17(9-11-18)23(16-6-7-16)31-34-14-15-4-12-19(13-5-15)29-25(33)30-24(32)22-20(27)2-1-3-21(22)28/h1-5,8-13,16,29-30H,6-7,14H2
54 atoms
Cl 6.256849 4.631164 -0.922449
F  -6.629015 -0.893747 2.108224
F  -5.549063 2.303814 -1.129121
O  3.888433 -2.931581 -0.035444
O  -3.103261 -1.115991 -2.614536
O  -3.983962 -0.123782 1.305177
N  4.167143 -1.645623 -0.406825
N  -2.23689 -1.153479 -0.49956
N  -4.380024 -0.353587 -0.926944
C  5.330267 -1.646979 1.728786
C  5.47841 -0.85292 2.987657
C  4.34377 -1.813851 2.852943
C  4.864782 -1.023588 0.46329
C  5.196455 0.375929 0.133579
C  6.42815 0.914599 0.502409
C  4.297231 1.181492 -0.564781
C  6.763971 2.218098 0.174993
C  4.616112 2.489001 -0.89074
C  5.851577 2.996508 -0.519349
C  2.94901 -3.503183 -0.927748
C  1.594627 -2.859068 -0.839707
C  0.847449 -2.619624 -1.983063
C  1.040589 -2.505915 0.388794
C  -0.971595 -1.719288 -0.695704
C  -0.424302 -2.062468 -1.929446
C  -0.217711 -1.94156 0.459936
C  -3.185901 -0.905225 -1.418235
C  -6.0426 0.671949 0.472972
C  -4.70337 0.034501 0.335759
C  -6.954261 0.194422 1.407433
C  -6.415461 1.802157 -0.24332
C  -8.180928 0.785691 1.617599
C  -7.625627 2.435731 -0.05838
C  -8.505032 1.913807 0.877791
H  6.023483 -2.471335 1.593988
H  5.246148 0.204069 2.960114
H  6.300168 -1.111593 3.642292
H  4.369393 -2.74107 3.409998
H  3.351964 -1.401261 2.71369
H  7.145712 0.312183 1.043736
H  3.327178 0.793489 -0.845119
H  7.727216 2.617923 0.460647
H  3.903234 3.104191 -1.422549
H  3.320674 -3.472891 -1.956401
H  2.896093 -4.552261 -0.629417
H  1.260291 -2.870393 -2.953077
H  1.589003 -2.671376 1.308194
H  -0.957857 -1.898779 -2.850516
H  -0.627508 -1.672767 1.426579
H  -2.476052 -0.930586 0.461835
H  -5.072215 -0.215787 -1.652652
H  -8.86739 0.373747 2.344609
H  -7.871768 3.319865 -0.630209
H  -9.460731 2.394318 1.034164
elementType: Cl F O N C H
totalener: -2014.65250737 hartree
nucrepener: 3310.70508210 hartree
electener: -5325.35758947 hartree
oneelecener: -9341.38683490 hartree
twoeener: 4016.02924543 hartree
cpcmener: -0.04826135 hartree
kineticenergy: 2007.64724013 hartree
xcener: -167.134260727950 hartree
chargesum: 0.0000000
charge: -0.096234 -0.203898 -0.208334 -0.232951 -0.522972 -0.468914 -0.166597 -0.170183 -0.150641 -0.078700 -0.183898 -0.186794 0.212966 0.056152 -0.226183 -0.214384 -0.144901 -0.156238 0.105815 0.102613 -0.026552 -0.161576 -0.204475 0.177578 -0.216526 -0.201513 0.432022 -0.126077 0.412279 0.300507 0.310457 -0.240393 -0.241316 -0.066067 0.112381 0.103887 0.097803 0.100014 0.094482 0.160055 0.140453 0.145060 0.144518 0.099909 0.110038 0.144451 0.155284 0.157177 0.143529 0.203424 0.194535 0.154311 0.154619 0.169999
qa: -0.0962 -0.2039 -0.2083 -0.2330 -0.5230 -0.4689 -0.1666 -0.1702 -0.1506 -0.0787 -0.1839 -0.1868 0.2130 0.0562 -0.2262 -0.2144 -0.1449 -0.1562 0.1058 0.1026 -0.0266 -0.1616 -0.2045 0.1776 -0.2165 -0.2015 0.4320 -0.1261 0.4123 0.3005 0.3105 -0.2404 -0.2413 -0.0661 0.1124 0.1039 0.0978 0.1000 0.0945 0.1601 0.1405 0.1451 0.1445 0.0999 0.1100 0.1445 0.1553 0.1572 0.1435 0.2034 0.1945 0.1543 0.1546 0.1700
va: 1.2092 1.0940 1.0863 1.9612 1.9829 2.0403 2.9121 3.2599 3.2210 3.8062 3.9291 3.9071 3.7530 3.5562 3.9825 4.0361 3.9852 4.0077 3.8312 3.8278 3.6518 3.9900 3.9667 3.8215 3.9609 3.9720 4.3022 3.5472 4.0641 3.9512 3.9254 3.9529 3.9561 3.8108 1.0095 1.0065 1.0162 1.0143 1.0149 0.9932 1.0183 1.0060 1.0066 1.0117 0.9928 1.0013 1.0007 1.0303 1.0087 1.0356 1.0080 1.0000 0.9999 0.9835
dispcorr: -0.025605281 hartree
energy: -2014.678112653625
dipole: 22.55354 -24.62802 -2.07448 -19.75139 19.92347 0.17208 9.16674 -7.71214 1.45460
magnitude: 2.53948 au
magnitude: 6.45484 debye
