program: Orca
programVersion: 5.0.2
elementType: Cl F F O O O N N N C C C C C C C C C C C C C C C C C C C C C C C C C H H H H H H H H H H H H H H H H H H H H
charge: 0
multiplicity: 1
keywords: wb97x-d3
keywords: def2-TZVPP
keywords: def2/J RIJCOSX
keywords: DEFGRID2
keywords: scfconv7
keywords: smallprint printgap noloewdin
keywords: NOSOSCF
formula: C25H20ClF2N3O3
InChI: InChI=1/C25H20ClF2N3O3/c26-18-10-8-17(9-11-18)23(16-6-7-16)31-34-14-15-4-12-19(13-5-15)29-25(33)30-24(32)22-20(27)2-1-3-21(22)28/h1-5,8-13,16,29-30H,6-7,14H2
54 atoms
Cl 5.96272 4.474028 2.089402
F  -7.150913 -1.12207 0.164934
F  -4.807696 2.910839 -0.096647
O  3.913104 -2.8294 -0.354316
O  -3.223467 -2.398668 -1.826285
O  -3.863302 0.45996 1.084812
N  4.106008 -1.6178 0.230035
N  -2.251444 -1.40571 -0.011846
N  -4.367152 -0.783191 -0.755257
C  5.4843 -1.211799 -1.742222
C  4.614692 -1.430106 -2.944639
C  5.514001 -0.239358 -2.880296
C  4.859777 -0.841017 -0.444259
C  5.116529 0.480494 0.162914
C  4.168669 1.09233 0.984468
C  6.327769 1.134601 -0.055872
C  4.421336 2.317791 1.575813
C  6.598757 2.356394 0.5396
C  5.639989 2.940319 1.351533
C  2.994622 -3.601792 0.413991
C  1.593022 -3.080704 0.311001
C  1.074097 -2.21432 1.267888
C  0.791049 -3.403832 -0.776446
C  -0.995189 -2.016959 0.037434
C  -0.198334 -1.691091 1.137009
C  -0.489989 -2.892411 -0.923618
C  -3.234784 -1.601705 -0.910352
C  -5.931612 0.867075 0.026783
C  -4.625487 0.165392 0.185045
C  -7.153017 0.208587 0.041637
C  -5.967305 2.252482 -0.070282
C  -8.358318 0.873225 -0.04018
C  -7.146107 2.959766 -0.16722
C  -8.341156 2.255346 -0.147848
H  6.339252 -1.875607 -1.652568
H  3.550319 -1.262438 -2.837774
H  4.872608 -2.245361 -3.608234
H  6.399225 -0.221679 -3.502897
H  5.053103 0.729736 -2.733483
H  3.212133 0.6162 1.154633
H  7.083492 0.686556 -0.687783
H  3.670588 2.783313 2.200149
H  7.549582 2.842879 0.368124
H  3.068682 -4.606927 -0.003113
H  3.321296 -3.644776 1.456724
H  1.667848 -1.94363 2.132078
H  1.166562 -4.077947 -1.537306
H  -0.578678 -1.018268 1.896551
H  -1.070368 -3.177948 -1.785103
H  -2.432997 -0.708203 0.7045
H  -5.050545 -0.921783 -1.489243
H  -9.28826 0.321491 -0.014941
H  -7.129912 4.037624 -0.255405
H  -9.275941 2.794412 -0.217705
elementType: Cl F O N C H
totalener: -2014.66609553 hartree
nucrepener: 3313.59398142 hartree
electener: -5328.26007695 hartree
oneelecener: -9347.07406748 hartree
twoeener: 4018.81399053 hartree
cpcmener: -0.03969412 hartree
kineticenergy: 2007.66901397 hartree
xcener: -167.134580062451 hartree
chargesum: -0.0000000
charge: -0.096054 -0.206289 -0.201192 -0.221087 -0.491517 -0.446290 -0.143602 -0.174851 -0.155961 -0.084115 -0.169358 -0.189725 0.204294 0.026862 -0.203300 -0.215345 -0.153223 -0.150885 0.107490 0.084895 -0.065906 -0.143553 -0.163236 0.198769 -0.218408 -0.216211 0.416966 -0.128520 0.401108 0.311201 0.295347 -0.242197 -0.238152 -0.065189 0.117160 0.088661 0.095432 0.094831 0.101535 0.145411 0.157337 0.141891 0.142013 0.109529 0.100515 0.140833 0.141941 0.140276 0.156082 0.199408 0.192528 0.152656 0.152478 0.166716
qa: -0.0961 -0.2063 -0.2012 -0.2211 -0.4915 -0.4463 -0.1436 -0.1749 -0.1560 -0.0841 -0.1694 -0.1897 0.2043 0.0269 -0.2033 -0.2153 -0.1532 -0.1509 0.1075 0.0849 -0.0659 -0.1436 -0.1632 0.1988 -0.2184 -0.2162 0.4170 -0.1285 0.4011 0.3112 0.2953 -0.2422 -0.2382 -0.0652 0.1172 0.0887 0.0954 0.0948 0.1015 0.1454 0.1573 0.1419 0.1420 0.1095 0.1005 0.1408 0.1419 0.1403 0.1561 0.1994 0.1925 0.1527 0.1525 0.1667
va: 1.2090 1.0886 1.0983 1.9727 2.0208 2.0689 2.9106 3.2523 3.2121 3.8008 3.9168 3.9227 3.7684 3.6209 4.0261 3.9891 4.0142 3.9955 3.8306 3.8531 3.6476 3.9199 3.9809 3.8024 3.9773 3.9700 4.3199 3.5456 4.0798 3.9331 3.9616 3.9612 3.9565 3.8134 1.0041 1.0183 1.0148 1.0164 1.0078 1.0094 0.9942 1.0078 1.0070 0.9962 1.0091 1.0112 1.0045 1.0086 1.0300 1.0416 1.0090 1.0009 1.0008 0.9848
dispcorr: -0.025373831 hartree
energy: -2014.691469364511
dipole: 23.72098 -25.65499 -1.93401 -17.97650 18.62031 0.64381 -12.75185 12.08079 -0.67106
magnitude: 2.14597 au
magnitude: 5.45463 debye
