program: Orca
programVersion: 5.0.2
elementType: Cl F F O O O N N N C C C C C C C C C C C C C C C C C C C C C C C C C H H H H H H H H H H H H H H H H H H H H
charge: 0
multiplicity: 1
keywords: wb97x-d3
keywords: def2-TZVPP
keywords: def2/J RIJCOSX
keywords: DEFGRID2
keywords: scfconv7
keywords: smallprint printgap noloewdin
keywords: NOSOSCF
formula: C25H20ClF2N3O3
InChI: InChI=1/C25H20ClF2N3O3/c26-18-10-8-17(9-11-18)23(16-6-7-16)31-34-14-15-4-12-19(13-5-15)29-25(33)30-24(32)22-20(27)2-1-3-21(22)28/h1-5,8-13,16,29-30H,6-7,14H2
54 atoms
Cl 5.512919 4.825724 0.180771
F  -5.254939 2.664657 -0.697003
F  -6.908452 -1.159854 1.414369
O  3.837294 -2.958107 -0.162776
O  -3.007076 -0.760798 -2.805597
O  -4.083936 -0.309108 1.166787
N  4.030821 -1.620687 -0.314483
N  -2.256206 -1.109826 -0.674867
N  -4.331287 -0.145061 -1.093553
C  5.439781 -1.889637 1.660646
C  6.431112 -2.969175 1.341397
C  6.889248 -1.706199 1.993411
C  4.80716 -1.113174 0.560644
C  5.014187 0.345831 0.452996
C  5.372475 1.093548 1.573476
C  4.814973 1.016737 -0.75544
C  5.522623 2.469835 1.499497
C  4.966565 2.388505 -0.844802
C  5.319111 3.108087 0.287903
C  2.938863 -3.430285 -1.152186
C  1.57121 -2.818026 -1.045916
C  0.88258 -2.422997 -2.182787
C  0.951616 -2.636555 0.188205
C  -0.995562 -1.680371 -0.880027
C  -0.388476 -1.865977 -2.119555
C  -0.30652 -2.073698 0.271222
C  -3.141998 -0.697854 -1.60014
C  -6.039902 0.727476 0.349114
C  -4.722492 0.04342 0.194708
C  -6.254675 2.031014 -0.075406
C  -7.086048 0.10023 1.012122
C  -7.443049 2.696142 0.140501
C  -8.296348 0.719024 1.240355
C  -8.461123 2.02505 0.801252
H  4.776912 -2.090847 2.497824
H  6.699059 -3.123367 0.303764
H  6.390273 -3.876713 1.930051
H  7.171856 -1.731203 3.038088
H  7.464878 -1.012377 1.39286
H  5.529276 0.608188 2.527557
H  4.544108 0.46196 -1.643699
H  5.794236 3.032343 2.382598
H  4.81407 2.889164 -1.79154
H  3.350292 -3.268735 -2.153783
H  2.898124 -4.509115 -0.98582
H  1.344865 -2.542014 -3.155922
H  1.452034 -2.930253 1.103078
H  -0.875222 -1.572744 -3.034971
H  -0.764116 -1.935332 1.244314
H  -2.5411 -1.006369 0.294429
H  -4.974149 0.1367 -1.823725
H  -7.567418 3.716329 -0.19706
H  -9.092094 0.192165 1.749594
H  -9.401606 2.528967 0.977433
elementType: Cl F O N C H
totalener: -2014.66550411 hartree
nucrepener: 3300.29547039 hartree
electener: -5314.96097450 hartree
oneelecener: -9320.73325990 hartree
twoeener: 4005.77228540 hartree
cpcmener: -0.04049622 hartree
kineticenergy: 2007.64873634 hartree
xcener: -167.132739791672 hartree
chargesum: 0.0000000
charge: -0.095661 -0.206421 -0.202077 -0.223292 -0.493314 -0.446140 -0.158813 -0.173094 -0.154822 -0.086919 -0.170267 -0.192287 0.221095 0.021112 -0.214695 -0.198601 -0.152761 -0.149087 0.106361 0.105793 -0.023495 -0.155779 -0.195822 0.180704 -0.216765 -0.199569 0.416793 -0.130269 0.396074 0.307939 0.304821 -0.241340 -0.242649 -0.066477 0.120603 0.089395 0.095441 0.096368 0.103547 0.158871 0.136735 0.141884 0.142034 0.098043 0.107983 0.140348 0.138164 0.155980 0.140413 0.197695 0.194859 0.153047 0.151885 0.166428
qa: -0.0957 -0.2064 -0.2021 -0.2233 -0.4933 -0.4461 -0.1588 -0.1731 -0.1548 -0.0869 -0.1703 -0.1923 0.2211 0.0211 -0.2147 -0.1986 -0.1528 -0.1491 0.1064 0.1058 -0.0235 -0.1558 -0.1958 0.1807 -0.2168 -0.1996 0.4168 -0.1303 0.3961 0.3079 0.3048 -0.2413 -0.2426 -0.0665 0.1206 0.0894 0.0954 0.0964 0.1035 0.1589 0.1367 0.1419 0.1420 0.0980 0.1080 0.1403 0.1382 0.1560 0.1404 0.1977 0.1949 0.1530 0.1519 0.1664
va: 1.2100 1.0883 1.0972 1.9739 2.0195 2.0687 2.9027 3.2540 3.2085 3.8044 3.9203 3.9183 3.7291 3.6697 3.9910 4.0261 4.0051 4.0033 3.8389 3.8359 3.6602 3.9838 3.9843 3.8235 3.9714 3.9584 4.3186 3.5491 4.0839 3.9366 3.9584 3.9606 3.9608 3.8124 1.0034 1.0193 1.0155 1.0162 1.0085 0.9930 1.0306 1.0075 1.0075 1.0078 0.9925 1.0029 1.0147 1.0311 1.0082 1.0422 1.0070 1.0005 1.0010 0.9850
dispcorr: -0.024887624 hartree
energy: -2014.690391733690
dipole: 29.24136 -30.95684 -1.71548 -22.99688 22.98721 -0.00967 3.36705 -2.31386 1.05319
magnitude: 2.01300 au
magnitude: 5.11663 debye
