program: Orca
programVersion: 5.0.2
elementType: Cl F F O O O N N N C C C C C C C C C C C C C C C C C C C C C C C C C H H H H H H H H H H H H H H H H H H H H
charge: 0
multiplicity: 1
keywords: wb97x-d3
keywords: def2-TZVPP
keywords: def2/J RIJCOSX
keywords: DEFGRID2
keywords: scfconv7
keywords: smallprint printgap noloewdin
keywords: NOSOSCF
formula: C25H20ClF2N3O3
InChI: InChI=1/C25H20ClF2N3O3/c26-18-10-8-17(9-11-18)23(16-6-7-16)31-34-14-15-4-12-19(13-5-15)29-25(33)30-24(32)22-20(27)2-1-3-21(22)28/h1-5,8-13,16,29-30H,6-7,14H2
54 atoms
Cl 5.514836 4.741562 1.184417
F  -5.315959 2.75621 1.063176
F  -6.975511 -1.027375 -1.127273
O  3.861731 -2.976497 0.0793
O  -2.608767 -1.216131 -2.268394
O  -4.313549 0.039196 1.290951
N  4.015039 -1.679197 0.463914
N  -2.259864 -1.184568 -0.010181
N  -4.154421 -0.228838 -0.967153
C  5.523073 -1.619395 -1.445862
C  6.952624 -1.302703 -1.756637
C  6.589081 -2.657014 -1.242854
C  4.835267 -1.030332 -0.266114
C  5.034672 0.384932 0.104558
C  5.378214 1.326833 -0.86388
C  4.84573 0.820622 1.417508
C  5.521591 2.666963 -0.541025
C  4.992454 2.154511 1.75511
C  5.328637 3.070584 0.769618
C  2.842754 -3.590727 0.85364
C  1.490592 -2.989057 0.60362
C  0.965796 -2.916957 -0.681661
C  0.736893 -2.463926 1.645562
C  -1.014457 -1.809322 0.117448
C  -0.267773 -2.338303 -0.937131
C  -0.499552 -1.889896 1.411778
C  -2.943202 -0.92047 -1.139226
C  -6.08948 0.846021 -0.041204
C  -4.772473 0.178212 0.174507
C  -6.320777 2.123229 0.454999
C  -7.154867 0.216477 -0.671104
C  -7.53307 2.764452 0.317018
C  -8.38886 0.812877 -0.822414
C  -8.564669 2.095152 -0.325087
H  4.869461 -1.784078 -2.298038
H  7.487334 -0.63986 -1.087396
H  7.226428 -1.197225 -2.798656
H  6.605231 -3.498396 -1.923615
H  6.872513 -2.899631 -0.226361
H  5.526002 1.023443 -1.891792
H  4.589524 0.109112 2.19116
H  5.780019 3.384214 -1.308288
H  4.850812 2.473504 2.779071
H  2.870304 -4.63955 0.551591
H  3.090375 -3.545313 1.918677
H  1.527055 -3.318285 -1.517617
H  1.119289 -2.497247 2.658772
H  -0.628507 -2.306133 -1.951813
H  -1.066609 -1.4864 2.242602
H  -2.675168 -0.852394 0.854731
H  -4.600857 -0.004388 -1.847555
H  -7.667176 3.765509 0.704333
H  -9.194409 0.283453 -1.313075
H  -9.524349 2.580974 -0.43671
elementType: Cl F O N C H
totalener: -2014.66599135 hartree
nucrepener: 3302.12648717 hartree
electener: -5316.79247852 hartree
oneelecener: -9324.48378782 hartree
twoeener: 4007.69130930 hartree
cpcmener: -0.04061167 hartree
kineticenergy: 2007.65147764 hartree
xcener: -167.132055902795 hartree
chargesum: 0.0000000
charge: -0.095663 -0.201039 -0.206230 -0.220037 -0.492861 -0.447532 -0.161616 -0.172798 -0.155167 -0.088605 -0.190126 -0.171144 0.216828 0.040772 -0.225654 -0.203741 -0.146426 -0.148073 0.103543 0.097506 -0.044405 -0.181529 -0.145912 0.186013 -0.212848 -0.212548 0.417888 -0.129314 0.399989 0.298563 0.306991 -0.239361 -0.239590 -0.065180 0.118003 0.103258 0.096131 0.095202 0.090568 0.159958 0.135867 0.141627 0.142179 0.112584 0.097055 0.137686 0.141122 0.156823 0.140381 0.197378 0.192346 0.152415 0.152374 0.166349
qa: -0.0957 -0.2010 -0.2062 -0.2200 -0.4929 -0.4475 -0.1616 -0.1728 -0.1552 -0.0886 -0.1901 -0.1711 0.2168 0.0408 -0.2257 -0.2037 -0.1464 -0.1481 0.1035 0.0975 -0.0444 -0.1815 -0.1459 0.1860 -0.2128 -0.2125 0.4179 -0.1293 0.4000 0.2986 0.3070 -0.2394 -0.2396 -0.0652 0.1180 0.1033 0.0961 0.0952 0.0906 0.1600 0.1359 0.1416 0.1422 0.1126 0.0971 0.1377 0.1411 0.1568 0.1404 0.1974 0.1923 0.1524 0.1524 0.1663
va: 1.2100 1.0985 1.0885 1.9661 2.0197 2.0659 2.9003 3.2552 3.2099 3.8082 3.9223 3.9161 3.7353 3.6326 3.9932 4.0285 3.9972 4.0022 3.8414 3.8364 3.6625 3.9888 3.9650 3.8214 3.9723 3.9595 4.3186 3.5479 4.0805 3.9613 3.9347 3.9567 3.9598 3.8138 1.0050 1.0080 1.0160 1.0154 1.0179 0.9923 1.0301 1.0074 1.0074 0.9937 1.0074 1.0144 1.0017 1.0309 1.0082 1.0409 1.0091 1.0009 1.0008 0.9850
dispcorr: -0.024849185 hartree
energy: -2014.690840532914
dipole: 29.42075 -31.23397 -1.81322 -22.26404 22.51597 0.25193 -5.99323 5.53759 -0.45564
magnitude: 1.88649 au
magnitude: 4.79508 debye
