program: Orca
programVersion: 5.0.2
elementType: Cl F F O O O N N N C C C C C C C C C C C C C C C C C C C C C C C C C H H H H H H H H H H H H H H H H H H H H
charge: 0
multiplicity: 1
keywords: wb97x-d3
keywords: def2-TZVPP
keywords: def2/J RIJCOSX
keywords: DEFGRID2
keywords: scfconv7
keywords: smallprint printgap noloewdin
keywords: NOSOSCF
formula: C25H20ClF2N3O3
InChI: InChI=1/C25H20ClF2N3O3/c26-18-10-8-17(9-11-18)23(16-6-7-16)31-34-14-15-4-12-19(13-5-15)29-25(33)30-24(32)22-20(27)2-1-3-21(22)28/h1-5,8-13,16,29-30H,6-7,14H2
54 atoms
Cl 6.437019 4.249139 2.250059
F  -6.499785 0.134815 -2.700919
F  -6.125818 1.560594 1.735856
O  3.743775 -2.657498 -0.682827
O  -3.551902 -2.160332 1.808313
O  -4.048731 0.57466 -1.251501
N  4.083122 -1.53568 0.012433
N  -2.43571 -1.12359 0.105114
N  -4.67749 -0.677379 0.544366
C  5.368977 -1.05327 -1.999906
C  6.794682 -0.813964 -2.389851
C  6.289058 -2.21227 -2.247286
C  4.887908 -0.774762 -0.620592
C  5.296564 0.452585 0.091766
C  5.65732 1.596257 -0.619172
C  5.300806 0.508253 1.486672
C  6.003495 2.767449 0.036107
C  5.649947 1.668996 2.153761
C  5.997636 2.79397 1.420732
C  2.795938 -3.411345 0.045381
C  1.434564 -2.77532 0.090545
C  0.584446 -3.025494 1.158883
C  0.966645 -1.965923 -0.940281
C  -1.166704 -1.710167 0.1699
C  -0.703984 -2.511572 1.211673
C  -0.310266 -1.43907 -0.89942
C  -3.507171 -1.382376 0.876432
C  -6.261207 0.819098 -0.477308
C  -4.888493 0.237881 -0.439428
C  -7.004993 0.783395 -1.651001
C  -6.825301 1.490524 0.599269
C  -8.248809 1.366512 -1.760159
C  -8.059627 2.101792 0.533372
C  -8.766106 2.029842 -0.65729
H  4.622585 -0.87691 -2.769568
H  7.476729 -0.447155 -1.632647
H  6.984092 -0.427443 -3.383092
H  6.122228 -2.803312 -3.138629
H  6.628017 -2.782438 -1.391407
H  5.661733 1.588418 -1.701021
H  5.038711 -0.36852 2.063597
H  6.273533 3.646794 -0.533103
H  5.655763 1.69172 3.235174
H  2.749371 -4.370202 -0.47695
H  3.158436 -3.611176 1.058857
H  0.928655 -3.638815 1.983843
H  1.594368 -1.738486 -1.792761
H  -1.319119 -2.732569 2.068557
H  -0.651983 -0.810943 -1.714102
H  -2.582185 -0.473924 -0.661823
H  -5.462197 -0.929812 1.132137
H  -8.800163 1.303346 -2.688508
H  -8.455698 2.625167 1.393049
H  -9.737455 2.499749 -0.728011
elementType: Cl F O N C H
totalener: -2014.66594294 hartree
nucrepener: 3270.85933135 hartree
electener: -5285.52527429 hartree
oneelecener: -9261.72605508 hartree
twoeener: 3976.20078079 hartree
cpcmener: -0.04072873 hartree
kineticenergy: 2007.64984323 hartree
xcener: -167.133204063817 hartree
chargesum: -0.0000000
charge: -0.095330 -0.200972 -0.206256 -0.223138 -0.494759 -0.449005 -0.162037 -0.177937 -0.154576 -0.081222 -0.192978 -0.169712 0.220053 0.030016 -0.222496 -0.198966 -0.150184 -0.151108 0.106900 0.103420 -0.013792 -0.165054 -0.195503 0.182135 -0.214332 -0.204454 0.416860 -0.127796 0.400289 0.300135 0.305862 -0.239866 -0.240454 -0.065147 0.118682 0.104100 0.096810 0.094470 0.090334 0.159143 0.136760 0.142137 0.142736 0.107887 0.099161 0.140636 0.142081 0.153152 0.140187 0.198892 0.192145 0.152346 0.152974 0.166773
qa: -0.0953 -0.2010 -0.2063 -0.2231 -0.4948 -0.4490 -0.1620 -0.1779 -0.1546 -0.0812 -0.1930 -0.1697 0.2201 0.0300 -0.2225 -0.1990 -0.1502 -0.1511 0.1069 0.1034 -0.0138 -0.1651 -0.1955 0.1821 -0.2143 -0.2045 0.4169 -0.1278 0.4003 0.3001 0.3059 -0.2399 -0.2405 -0.0651 0.1187 0.1041 0.0968 0.0945 0.0903 0.1591 0.1368 0.1421 0.1427 0.1079 0.0992 0.1406 0.1421 0.1532 0.1402 0.1989 0.1921 0.1523 0.1530 0.1668
va: 1.2104 1.0983 1.0889 1.9844 2.0175 2.0648 2.8992 3.2494 3.2113 3.8037 3.9245 3.9165 3.7301 3.6478 3.9928 4.0266 4.0001 4.0053 3.8402 3.8422 3.6484 3.9915 3.9912 3.8037 3.9778 3.9802 4.3209 3.5473 4.0827 3.9565 3.9345 3.9559 3.9599 3.8127 1.0043 1.0079 1.0162 1.0160 1.0186 0.9928 1.0295 1.0074 1.0074 0.9911 1.0124 1.0022 1.0128 1.0301 1.0089 1.0414 1.0096 1.0009 1.0007 0.9849
dispcorr: -0.024741904 hartree
energy: -2014.690684839896
dipole: 27.34069 -29.19906 -1.85837 -19.29115 19.65997 0.36882 -11.23326 9.99851 -1.23474
magnitude: 2.26145 au
magnitude: 5.74814 debye
