program: Orca
programVersion: 5.0.2
elementType: Cl F F O O O N N N C C C C C C C C C C C C C C C C C C C C C C C C C H H H H H H H H H H H H H H H H H H H H
charge: 0
multiplicity: 1
keywords: wb97x-d3
keywords: def2-TZVPP
keywords: def2/J RIJCOSX
keywords: DEFGRID2
keywords: scfconv7
keywords: smallprint printgap noloewdin
keywords: NOSOSCF
formula: C25H20ClF2N3O3
InChI: InChI=1/C25H20ClF2N3O3/c26-18-10-8-17(9-11-18)23(16-6-7-16)31-34-14-15-4-12-19(13-5-15)29-25(33)30-24(32)22-20(27)2-1-3-21(22)28/h1-5,8-13,16,29-30H,6-7,14H2
54 atoms
Cl 5.766634 4.435856 2.02797
F  -5.061939 2.864112 -1.227281
F  -7.159641 -1.05797 0.211057
O  3.801806 -2.821363 -0.615585
O  -3.188938 -1.545609 2.209847
O  -4.011282 0.197873 -1.4469
N  4.028898 -1.647012 0.03583
N  -2.33358 -1.2386 0.112974
N  -4.394825 -0.355472 0.728715
C  5.409245 -1.194839 -1.918579
C  6.832454 -0.864353 -2.2454
C  6.432991 -2.28693 -2.029806
C  4.822652 -0.869785 -0.591443
C  5.094192 0.425906 0.06384
C  5.41235 1.549604 -0.697396
C  4.99677 0.568771 1.448998
C  5.616327 2.78459 -0.101893
C  5.204062 1.794307 2.057322
C  5.509705 2.897769 1.274183
C  2.861835 -3.601056 0.100782
C  1.490747 -2.988491 0.124396
C  0.696194 -3.071182 1.258088
C  0.970933 -2.33754 -0.991292
C  -1.083659 -1.860864 0.190343
C  -0.581423 -2.527773 1.305106
C  -0.291617 -1.780276 -0.958449
C  -3.255611 -1.099019 1.082113
C  -6.057308 0.879672 -0.492007
C  -4.725328 0.210803 -0.462831
C  -6.175248 2.195324 -0.92493
C  -7.237037 0.217214 -0.180134
C  -7.390613 2.836993 -1.027517
C  -8.476563 0.813039 -0.277931
C  -8.539754 2.13105 -0.70264
H  4.700533 -1.135524 -2.739936
H  7.436935 -0.392122 -1.480618
H  7.049631 -0.531962 -3.252353
H  6.368316 -2.949528 -2.88336
H  6.76213 -2.766904 -1.116651
H  5.491026 1.475826 -1.773906
H  4.763899 -0.288701 2.066209
H  5.853288 3.646153 -0.711516
H  5.131036 1.88391 3.132806
H  2.8503 -4.559504 -0.423685
H  3.213368 -3.79058 1.120085
H  1.077354 -3.567492 2.143117
H  1.553995 -2.251991 -1.900098
H  -1.154639 -2.619984 2.212943
H  -0.670968 -1.268732 -1.8356
H  -2.547632 -0.789973 -0.772806
H  -5.034849 -0.23479 1.504171
H  -7.437048 3.866702 -1.354973
H  -9.370647 0.256064 -0.032105
H  -9.501992 2.617946 -0.783011
elementType: Cl F O N C H
totalener: -2014.66592566 hartree
nucrepener: 3293.72270243 hartree
electener: -5308.38862810 hartree
oneelecener: -9307.57703097 hartree
twoeener: 3999.18840287 hartree
cpcmener: -0.04075013 hartree
kineticenergy: 2007.65906273 hartree
xcener: -167.134923182662 hartree
chargesum: -0.0000000
charge: -0.095381 -0.200614 -0.206259 -0.221304 -0.494953 -0.448668 -0.163417 -0.174379 -0.153953 -0.085318 -0.190540 -0.172556 0.219831 0.035352 -0.222915 -0.202855 -0.149253 -0.147746 0.105046 0.105452 -0.022635 -0.157700 -0.195416 0.181064 -0.217064 -0.201655 0.416586 -0.129513 0.401418 0.300225 0.306734 -0.240223 -0.240657 -0.062907 0.119022 0.103365 0.096666 0.095513 0.090501 0.159349 0.136445 0.141881 0.142048 0.107405 0.098229 0.140515 0.139111 0.154762 0.140444 0.198680 0.191181 0.151834 0.152873 0.166353
qa: -0.0954 -0.2006 -0.2063 -0.2213 -0.4950 -0.4487 -0.1634 -0.1744 -0.1540 -0.0853 -0.1905 -0.1726 0.2198 0.0354 -0.2229 -0.2029 -0.1493 -0.1477 0.1050 0.1055 -0.0226 -0.1577 -0.1954 0.1811 -0.2171 -0.2017 0.4166 -0.1295 0.4014 0.3002 0.3067 -0.2402 -0.2407 -0.0629 0.1190 0.1034 0.0967 0.0955 0.0905 0.1593 0.1364 0.1419 0.1420 0.1074 0.0982 0.1405 0.1391 0.1548 0.1404 0.1987 0.1912 0.1518 0.1529 0.1664
va: 1.2101 1.0988 1.0887 1.9779 2.0178 2.0651 2.9016 3.2534 3.2141 3.8078 3.9225 3.9168 3.7286 3.6431 3.9918 4.0291 3.9999 4.0020 3.8411 3.8350 3.6569 3.9886 3.9868 3.8229 3.9722 3.9641 4.3196 3.5494 4.0784 3.9587 3.9312 3.9566 3.9603 3.8121 1.0041 1.0081 1.0159 1.0155 1.0183 0.9927 1.0299 1.0073 1.0074 0.9922 1.0099 1.0027 1.0147 1.0319 1.0085 1.0418 1.0101 1.0012 1.0007 0.9849
dispcorr: -0.024809114 hartree
energy: -2014.690734777348
dipole: 28.49807 -30.25614 -1.75807 -20.40182 20.82281 0.42099 -10.16604 8.95855 -1.20749
magnitude: 2.17395 au
magnitude: 5.52575 debye
