program: Orca
programVersion: 5.0.2
elementType: Cl F F O O O N N N C C C C C C C C C C C C C C C C C C C C C C C C C H H H H H H H H H H H H H H H H H H H H
charge: 0
multiplicity: 1
keywords: wb97x-d3
keywords: def2-TZVPP
keywords: def2/J RIJCOSX
keywords: DEFGRID2
keywords: scfconv7
keywords: smallprint printgap noloewdin
keywords: NOSOSCF
formula: C25H20ClF2N3O3
InChI: InChI=1/C25H20ClF2N3O3/c26-18-10-8-17(9-11-18)23(16-6-7-16)31-34-14-15-4-12-19(13-5-15)29-25(33)30-24(32)22-20(27)2-1-3-21(22)28/h1-5,8-13,16,29-30H,6-7,14H2
54 atoms
Cl 5.928425 4.828098 0.122045
F  -5.424824 2.815113 -0.871404
F  -7.154484 -1.280127 0.549548
O  3.831441 -2.834265 -0.442614
O  -2.722072 -1.448211 1.867027
O  -4.433489 0.137539 -1.55006
N  4.072372 -1.498515 -0.538032
N  -2.347052 -1.134953 -0.365415
N  -4.304521 -0.400547 0.660318
C  5.428769 -1.913161 1.441377
C  6.465603 -2.947645 1.106943
C  6.840514 -1.746342 1.91127
C  4.865081 -1.062076 0.360813
C  5.166447 0.381782 0.293368
C  5.149728 1.062675 -0.924666
C  5.436475 1.104323 1.454507
C  5.385526 2.425222 -0.983932
C  5.666732 2.470425 1.410571
C  5.638211 3.121473 0.188287
C  2.865315 -3.221087 -1.406868
C  1.498542 -2.675019 -1.109905
C  0.911061 -2.862129 0.136686
C  0.779123 -1.973716 -2.068879
C  -1.066704 -1.671624 -0.540166
C  -0.352115 -2.374266 0.431833
C  -0.485785 -1.483755 -1.794714
C  -3.058707 -1.041604 0.773405
C  -6.244385 0.747658 -0.164514
C  -4.912833 0.130773 -0.433457
C  -6.458915 2.091104 -0.440869
C  -7.331096 0.0199 0.29709
C  -7.68181 2.700341 -0.260466
C  -8.576262 0.582317 0.485821
C  -8.738225 1.930178 0.203741
H  4.702734 -2.209296 2.19325
H  6.820115 -2.997533 0.085031
H  6.391917 -3.908269 1.600457
H  7.032031 -1.86828 2.969482
H  7.453492 -0.993613 1.430716
H  4.961076 0.525147 -1.844225
H  5.454452 0.607364 2.415514
H  5.376196 2.934449 -1.938127
H  5.862946 3.015169 2.324277
H  3.187266 -2.92795 -2.411111
H  2.865841 -4.312404 -1.366087
H  1.441981 -3.40596 0.909173
H  1.208134 -1.801462 -3.04882
H  -0.761427 -2.553713 1.412027
H  -1.022771 -0.938366 -2.562201
H  -2.769669 -0.719895 -1.190227
H  -4.781227 -0.319445 1.550548
H  -7.805711 3.752714 -0.476513
H  -9.40138 -0.020864 0.839441
H  -9.706269 2.390119 0.347619
elementType: Cl F O N C H
totalener: -2014.66613181 hartree
nucrepener: 3286.80508609 hartree
electener: -5301.47121789 hartree
oneelecener: -9293.80407303 hartree
twoeener: 3992.33285513 hartree
cpcmener: -0.04078052 hartree
kineticenergy: 2007.65557897 hartree
xcener: -167.132346153657 hartree
chargesum: -0.0000000
charge: -0.095704 -0.201990 -0.206320 -0.220301 -0.493004 -0.446568 -0.163656 -0.174787 -0.154541 -0.086089 -0.172393 -0.189497 0.218557 0.039078 -0.203830 -0.225536 -0.148905 -0.145571 0.103033 0.105003 -0.047183 -0.181989 -0.145400 0.184564 -0.213414 -0.209817 0.417824 -0.130621 0.396385 0.301064 0.314711 -0.242707 -0.245806 -0.064614 0.117521 0.091060 0.095117 0.096260 0.103306 0.136307 0.158444 0.141932 0.142221 0.096539 0.112104 0.136811 0.141985 0.156452 0.139529 0.197652 0.194667 0.152187 0.153390 0.166542
qa: -0.0957 -0.2020 -0.2063 -0.2203 -0.4930 -0.4466 -0.1637 -0.1748 -0.1545 -0.0861 -0.1724 -0.1895 0.2186 0.0391 -0.2038 -0.2255 -0.1489 -0.1456 0.1030 0.1050 -0.0472 -0.1820 -0.1454 0.1846 -0.2134 -0.2098 0.4178 -0.1306 0.3964 0.3011 0.3147 -0.2427 -0.2458 -0.0646 0.1175 0.0911 0.0951 0.0963 0.1033 0.1363 0.1584 0.1419 0.1422 0.0965 0.1121 0.1368 0.1420 0.1565 0.1395 0.1977 0.1947 0.1522 0.1534 0.1665
va: 1.2098 1.0974 1.0884 1.9684 2.0191 2.0678 2.9013 3.2524 3.2090 3.8077 3.9164 3.9224 3.7336 3.6314 4.0296 3.9915 4.0033 3.9935 3.8434 3.8259 3.6766 3.9929 3.9656 3.8175 3.9790 3.9623 4.3187 3.5493 4.0835 3.9585 3.9334 3.9605 3.9622 3.8105 1.0052 1.0178 1.0157 1.0161 1.0078 1.0288 0.9931 1.0074 1.0070 1.0095 0.9935 1.0155 1.0014 1.0301 1.0086 1.0419 1.0073 1.0009 1.0005 0.9850
dispcorr: -0.024757311 hartree
energy: -2014.690889118603
dipole: 28.66776 -30.57114 -1.90338 -22.79503 22.86457 0.06954 3.15580 -2.79938 0.35641
magnitude: 1.93771 au
magnitude: 4.92527 debye
