program: Orca
programVersion: 5.0.2
elementType: Cl F F O O O N N N C C C C C C C C C C C C C C C C C C C C C C C C C H H H H H H H H H H H H H H H H H H H H
charge: 0
multiplicity: 1
keywords: wb97x-d3
keywords: def2-TZVPP
keywords: def2/J RIJCOSX
keywords: DEFGRID2
keywords: scfconv7
keywords: smallprint printgap noloewdin
keywords: NOSOSCF
formula: C25H20ClF2N3O3
InChI: InChI=1/C25H20ClF2N3O3/c26-18-10-8-17(9-11-18)23(16-6-7-16)31-34-14-15-4-12-19(13-5-15)29-25(33)30-24(32)22-20(27)2-1-3-21(22)28/h1-5,8-13,16,29-30H,6-7,14H2
54 atoms
Cl 6.98148 4.439162 -0.219007
F  -6.371035 1.320045 -1.901562
F  -6.632185 -0.506831 2.385737
O  3.666674 -2.794321 -0.330073
O  -2.036566 1.445077 -0.578399
O  -4.936844 -1.416879 0.152838
N  4.141292 -1.530347 -0.507883
N  -2.363761 -0.814777 -0.483555
N  -4.107071 0.686417 -0.135691
C  4.825897 -1.780403 1.81595
C  5.856616 -2.865401 1.972856
C  5.990168 -1.589719 2.736255
C  4.729253 -1.058447 0.520737
C  5.307789 0.28857 0.346093
C  5.892689 0.661753 -0.863481
C  5.251071 1.225127 1.377114
C  6.408602 1.934209 -1.043916
C  5.753912 2.504542 1.20711
C  6.332963 2.847904 -0.004712
C  2.775124 -3.129417 -1.389657
C  1.422105 -2.506929 -1.202094
C  0.373882 -3.234458 -0.647323
C  1.186066 -1.176203 -1.532048
C  -1.08001 -1.309911 -0.737274
C  -0.859193 -2.65115 -0.42097
C  -0.042148 -0.572796 -1.307449
C  -2.747274 0.47426 -0.416456
C  -6.458734 0.383508 0.235861
C  -5.101077 -0.21508 0.082144
C  -7.069284 1.098539 -0.784061
C  -7.207705 0.157832 1.382372
C  -8.363609 1.564991 -0.693901
C  -8.499746 0.615937 1.52544
C  -9.071373 1.315095 0.471861
H  3.866542 -1.983707 2.28214
H  6.540416 -3.032724 1.150043
H  5.561229 -3.763886 2.499048
H  5.790011 -1.599015 3.799911
H  6.775379 -0.906091 2.438562
H  5.962725 -0.053339 -1.672502
H  4.797364 0.965276 2.324887
H  6.86987 2.203899 -1.984447
H  5.691866 3.223519 2.01292
H  3.216953 -2.842103 -2.347567
H  2.70197 -4.217506 -1.365163
H  0.517584 -4.276344 -0.386093
H  1.975248 -0.585176 -1.979866
H  -1.659403 -3.241323 0.010537
H  -0.176042 0.458906 -1.589915
H  -3.067928 -1.507999 -0.250419
H  -4.349312 1.6688 -0.096962
H  -8.808784 2.104994 -1.518556
H  -9.047934 0.429674 2.439047
H  -10.087437 1.6739 0.562268
elementType: Cl F O N C H
totalener: -2014.66542271 hartree
nucrepener: 3283.91066275 hartree
electener: -5298.57608547 hartree
oneelecener: -9287.97912184 hartree
twoeener: 3989.40303638 hartree
cpcmener: -0.04038649 hartree
kineticenergy: 2007.66410301 hartree
xcener: -167.132167548167 hartree
chargesum: -0.0000000
charge: -0.095602 -0.206483 -0.201772 -0.224603 -0.491483 -0.446381 -0.168036 -0.180816 -0.155147 -0.109816 -0.166313 -0.179115 0.229357 0.069826 -0.209548 -0.235875 -0.149833 -0.141576 0.102319 0.090238 -0.070317 -0.152269 -0.137932 0.195603 -0.207477 -0.223653 0.418439 -0.129018 0.396371 0.304274 0.305861 -0.239633 -0.242471 -0.067030 0.111570 0.093083 0.094930 0.095748 0.100560 0.137479 0.157040 0.142710 0.142620 0.099923 0.104618 0.141969 0.138676 0.140612 0.152391 0.199220 0.194591 0.153111 0.152197 0.166863
qa: -0.0956 -0.2065 -0.2018 -0.2246 -0.4915 -0.4464 -0.1680 -0.1808 -0.1551 -0.1098 -0.1663 -0.1791 0.2294 0.0698 -0.2095 -0.2359 -0.1498 -0.1416 0.1023 0.0902 -0.0703 -0.1523 -0.1379 0.1956 -0.2075 -0.2237 0.4184 -0.1290 0.3964 0.3043 0.3059 -0.2396 -0.2425 -0.0670 0.1116 0.0931 0.0949 0.0957 0.1006 0.1375 0.1570 0.1427 0.1426 0.0999 0.1046 0.1420 0.1387 0.1406 0.1524 0.1992 0.1946 0.1531 0.1522 0.1669
va: 1.2099 1.0882 1.0976 1.9679 2.0198 2.0668 2.8618 3.2428 3.2042 3.8385 3.9043 3.9252 3.6940 3.5814 4.0191 3.9909 3.9982 3.9846 3.8439 3.8434 3.6742 3.9733 3.9351 3.7828 3.9699 4.0091 4.3203 3.5445 4.0900 3.9350 3.9550 3.9602 3.9582 3.8127 1.0101 1.0160 1.0161 1.0163 1.0081 1.0253 0.9939 1.0069 1.0066 1.0108 0.9981 1.0015 1.0228 1.0082 1.0285 1.0403 1.0072 1.0002 1.0009 0.9848
dispcorr: -0.024896235 hartree
energy: -2014.690318948648
dipole: 24.08091 -26.57539 -2.49448 -21.27987 20.92620 -0.35367 5.39224 -4.55737 0.83487
magnitude: 2.65415 au
magnitude: 6.74631 debye
