program: Orca
programVersion: 5.0.2
elementType: Cl F F O O O N N N C C C C C C C C C C C C C C C C C C C C C C C C C H H H H H H H H H H H H H H H H H H H H
charge: 0
multiplicity: 1
keywords: wb97x-d3
keywords: def2-TZVPP
keywords: def2/J RIJCOSX
keywords: DEFGRID2
keywords: scfconv7
keywords: smallprint printgap noloewdin
keywords: NOSOSCF
formula: C25H20ClF2N3O3
InChI: InChI=1/C25H20ClF2N3O3/c26-18-10-8-17(9-11-18)23(16-6-7-16)31-34-14-15-4-12-19(13-5-15)29-25(33)30-24(32)22-20(27)2-1-3-21(22)28/h1-5,8-13,16,29-30H,6-7,14H2
54 atoms
Cl 7.257933 4.38881 -0.235142
F  -7.316414 -0.856997 1.634682
F  -6.040253 1.426043 -2.224973
O  3.621092 -2.639399 0.584025
O  -2.315857 1.585212 0.707577
O  -5.009838 -1.433106 -0.181012
N  4.142757 -1.384744 0.630434
N  -2.475069 -0.681565 0.468465
N  -4.324153 0.707547 0.200089
C  5.105726 -2.036874 -1.50742
C  6.414689 -2.101194 -2.229654
C  6.012859 -3.222314 -1.329603
C  4.887129 -1.108171 -0.367842
C  5.507875 0.230764 -0.33653
C  5.881254 0.818083 0.872733
C  5.700637 0.951316 -1.514099
C  6.421886 2.092042 0.910893
C  6.232815 2.230433 -1.489833
C  6.588729 2.792007 -0.273968
C  2.686328 -2.821319 1.643011
C  1.343608 -2.224176 1.339474
C  0.315855 -3.012175 0.831398
C  1.084946 -0.872716 1.540355
C  -1.176035 -1.115283 0.754467
C  -0.924082 -2.472509 0.545756
C  -0.151198 -0.31115 1.25382
C  -2.952007 0.577244 0.478288
C  -6.634091 0.280528 -0.281453
C  -5.248455 -0.24557 -0.092732
C  -7.642312 -0.081147 0.599203
C  -6.990339 1.08975 -1.348376
C  -8.942885 0.351557 0.456659
C  -8.279882 1.537459 -1.542555
C  -9.249941 1.163343 -0.625305
H  4.216229 -2.221933 -2.102275
H  7.217067 -1.454699 -1.89713
H  6.386307 -2.259318 -3.300119
H  5.700516 -4.160973 -1.768321
H  6.536637 -3.32168 -0.387142
H  5.761434 0.271744 1.798816
H  5.419899 0.522835 -2.467488
H  6.713519 2.529117 1.856481
H  6.364222 2.78037 -2.411901
H  2.601432 -3.902462 1.760696
H  3.098639 -2.414406 2.569857
H  0.47869 -4.070166 0.663703
H  1.859989 -0.23124 1.940877
H  -1.709846 -3.112897 0.162682
H  -0.301339 0.739528 1.439411
H  -3.138279 -1.411193 0.226064
H  -4.647237 1.664951 0.269563
H  -9.697645 0.061547 1.174656
H  -8.519558 2.162322 -2.391898
H  -10.26567 1.509671 -0.756349
elementType: Cl F O N C H
totalener: -2014.66544715 hartree
nucrepener: 3260.98356333 hartree
electener: -5275.64901049 hartree
oneelecener: -9242.01949184 hartree
twoeener: 3966.37048135 hartree
cpcmener: -0.04002939 hartree
kineticenergy: 2007.66870837 hartree
xcener: -167.133027718388 hartree
chargesum: -0.0000000
charge: -0.095608 -0.202831 -0.206064 -0.220159 -0.490559 -0.444525 -0.161198 -0.174224 -0.154724 -0.098333 -0.184115 -0.168421 0.223757 0.052916 -0.207988 -0.231431 -0.147765 -0.141998 0.101572 0.090136 -0.075075 -0.149221 -0.133372 0.194177 -0.212136 -0.229706 0.418714 -0.127532 0.391572 0.300207 0.318654 -0.245512 -0.248355 -0.064728 0.112858 0.101469 0.096305 0.094201 0.092354 0.137311 0.158012 0.142166 0.142076 0.105236 0.099124 0.141669 0.139383 0.140979 0.155285 0.198083 0.195780 0.152361 0.152665 0.166556
qa: -0.0956 -0.2028 -0.2061 -0.2202 -0.4906 -0.4445 -0.1612 -0.1742 -0.1547 -0.0983 -0.1841 -0.1684 0.2238 0.0529 -0.2080 -0.2314 -0.1478 -0.1420 0.1016 0.0901 -0.0751 -0.1492 -0.1334 0.1942 -0.2121 -0.2297 0.4187 -0.1275 0.3916 0.3002 0.3187 -0.2455 -0.2484 -0.0647 0.1129 0.1015 0.0963 0.0942 0.0924 0.1373 0.1580 0.1422 0.1421 0.1052 0.0991 0.1417 0.1394 0.1410 0.1553 0.1981 0.1958 0.1524 0.1527 0.1666
va: 1.2102 1.0963 1.0884 1.9723 2.0215 2.0693 2.8780 3.2518 3.2066 3.8297 3.9233 3.9072 3.7137 3.6110 4.0188 3.9896 3.9979 3.9889 3.8445 3.8432 3.6856 3.9753 3.9428 3.8063 3.9608 4.0052 4.3165 3.5476 4.0880 3.9623 3.9355 3.9635 3.9647 3.8078 1.0090 1.0080 1.0161 1.0162 1.0168 1.0262 0.9933 1.0071 1.0070 0.9982 1.0111 1.0019 1.0203 1.0079 1.0305 1.0409 1.0059 1.0008 1.0009 0.9848
dispcorr: -0.024683912 hartree
energy: -2014.690131065205
dipole: 25.04315 -27.45223 -2.40908 -21.80216 21.24369 -0.55847 -2.25751 1.59015 -0.66736
magnitude: 2.56143 au
magnitude: 6.51064 debye
