program: Orca
programVersion: 5.0.2
elementType: Cl F F O O O N N N C C C C C C C C C C C C C C C C C C C C C C C C C H H H H H H H H H H H H H H H H H H H H
charge: 0
multiplicity: 1
keywords: wb97x-d3
keywords: def2-TZVPP
keywords: def2/J RIJCOSX
keywords: DEFGRID2
keywords: scfconv7
keywords: smallprint printgap noloewdin
keywords: NOSOSCF
formula: C25H20ClF2N3O3
InChI: InChI=1/C25H20ClF2N3O3/c26-18-10-8-17(9-11-18)23(16-6-7-16)31-34-14-15-4-12-19(13-5-15)29-25(33)30-24(32)22-20(27)2-1-3-21(22)28/h1-5,8-13,16,29-30H,6-7,14H2
54 atoms
Cl 8.036812 3.860069 -1.48557
F  -7.041379 -1.021361 2.257562
F  -6.419766 1.547165 -1.59051
O  3.628168 -2.61526 -0.023637
O  -2.203136 1.380022 0.11642
O  -5.150808 -1.52454 0.064184
N  4.251373 -1.491078 -0.462975
N  -2.529607 -0.859359 -0.196778
N  -4.306074 0.58643 0.217557
C  5.134413 -1.434134 1.810464
C  5.12454 -0.494212 2.976933
C  3.960291 -1.400306 2.744547
C  4.979592 -0.927984 0.420547
C  5.713193 0.270909 -0.034168
C  6.917649 0.632026 0.567249
C  5.239027 1.0513 -1.090578
C  7.638992 1.730195 0.125108
C  5.945059 2.153983 -1.537598
C  7.146216 2.483584 -0.92725
C  2.678675 -3.073972 -0.978274
C  1.32197 -2.458411 -0.779692
C  0.227357 -3.25085 -0.452225
C  1.112782 -1.088682 -0.916037
C  -1.222846 -1.32269 -0.386735
C  -1.027094 -2.697632 -0.263865
C  -0.134452 -0.515955 -0.721371
C  -2.923952 0.405555 0.041754
C  -6.680633 0.252685 0.334051
C  -5.31363 -0.326746 0.187528
C  -7.52248 -0.162099 1.357204
C  -7.202993 1.154392 -0.58207
C  -8.814362 0.301267 1.487565
C  -8.492116 1.636441 -0.501404
C  -9.290351 1.202288 0.545816
H  5.779884 -2.303343 1.899813
H  4.985102 0.561799 2.780068
H  5.795412 -0.708723 3.798959
H  3.81824 -2.248689 3.401608
H  3.040425 -0.954735 2.386719
H  7.315116 0.048744 1.387202
H  4.299712 0.804772 -1.567537
H  8.575881 1.989069 0.59964
H  5.557127 2.751116 -2.351966
H  3.056129 -2.887766 -1.987266
H  2.620961 -4.154861 -0.840109
H  0.349314 -4.32181 -0.340645
H  1.933376 -0.438691 -1.193308
H  -1.862254 -3.340788 -0.011666
H  -0.243495 0.548609 -0.85092
H  -3.252563 -1.571113 -0.155242
H  -4.55221 1.552117 0.397073
H  -9.434877 -0.034811 2.307372
H  -8.863589 2.330841 -1.242944
H  -10.303255 1.571951 0.629166
elementType: Cl F O N C H
totalener: -2014.66440917 hartree
nucrepener: 3270.31858537 hartree
electener: -5284.98299454 hartree
oneelecener: -9260.47765775 hartree
twoeener: 3975.49466321 hartree
cpcmener: -0.04009505 hartree
kineticenergy: 2007.64856469 hartree
xcener: -167.131283172638 hartree
chargesum: 0.0000000
charge: -0.096236 -0.201829 -0.206367 -0.219776 -0.492632 -0.446428 -0.156905 -0.181444 -0.155601 -0.085078 -0.193715 -0.170191 0.205486 0.013704 -0.211987 -0.201378 -0.151035 -0.157221 0.111294 0.097038 -0.094595 -0.143190 -0.128772 0.195360 -0.204172 -0.227091 0.417788 -0.128742 0.397753 0.303863 0.306353 -0.242595 -0.240794 -0.066150 0.118035 0.103264 0.095812 0.095397 0.088186 0.158687 0.153886 0.142608 0.141010 0.102892 0.102051 0.141162 0.156573 0.140949 0.149102 0.199051 0.194518 0.152403 0.152802 0.166894
qa: -0.0962 -0.2018 -0.2064 -0.2198 -0.4926 -0.4464 -0.1569 -0.1814 -0.1556 -0.0851 -0.1937 -0.1702 0.2055 0.0137 -0.2120 -0.2014 -0.1510 -0.1572 0.1113 0.0970 -0.0946 -0.1432 -0.1288 0.1954 -0.2042 -0.2271 0.4178 -0.1287 0.3978 0.3039 0.3064 -0.2426 -0.2408 -0.0662 0.1180 0.1033 0.0958 0.0954 0.0882 0.1587 0.1539 0.1426 0.1410 0.1029 0.1021 0.1412 0.1566 0.1409 0.1491 0.1991 0.1945 0.1524 0.1528 0.1669
va: 1.2089 1.0975 1.0882 1.9797 2.0185 2.0664 2.9073 3.2437 3.2039 3.8079 3.9230 3.9178 3.7571 3.6675 3.9874 4.0082 3.9976 4.0289 3.8289 3.8249 3.7279 3.9714 3.9137 3.7734 3.9732 4.0229 4.3219 3.5431 4.0863 3.9568 3.9324 3.9584 3.9610 3.8118 1.0036 1.0074 1.0164 1.0151 1.0181 0.9932 1.0103 1.0071 1.0099 1.0143 0.9999 1.0011 0.9926 1.0080 1.0325 1.0408 1.0073 1.0008 1.0005 0.9847
dispcorr: -0.025316124 hartree
energy: -2014.689725289261
dipole: 18.87342 -21.54849 -2.67507 -15.74300 15.52208 -0.22092 9.64911 -8.80135 0.84776
magnitude: 2.81487 au
magnitude: 7.15484 debye
