program: Orca
programVersion: 5.0.2
elementType: Cl F F O O O N N N C C C C C C C C C C C C C C C C C C C C C C C C C H H H H H H H H H H H H H H H H H H H H
charge: 0
multiplicity: 1
keywords: wb97x-d3
keywords: def2-TZVPP
keywords: def2/J RIJCOSX
keywords: DEFGRID2
keywords: scfconv7
keywords: smallprint printgap noloewdin
keywords: NOSOSCF
formula: C25H20ClF2N3O3
InChI: InChI=1/C25H20ClF2N3O3/c26-18-10-8-17(9-11-18)23(16-6-7-16)31-34-14-15-4-12-19(13-5-15)29-25(33)30-24(32)22-20(27)2-1-3-21(22)28/h1-5,8-13,16,29-30H,6-7,14H2
54 atoms
Cl 5.679493 4.407456 1.959972
F  -4.880084 2.668438 -1.458134
F  -6.9606 -1.000783 0.534707
O  3.91954 -2.967012 -0.500132
O  -2.754567 -1.027922 2.403209
O  -3.962012 -0.139402 -1.451144
N  4.092102 -1.764369 0.115897
N  -2.152497 -1.276332 0.211965
N  -4.115961 -0.188397 0.821545
C  5.449641 -1.315092 -1.852785
C  4.57662 -1.411336 -3.071931
C  5.580132 -0.311669 -2.955743
C  4.827309 -0.962682 -0.549479
C  5.033652 0.364412 0.063125
C  6.232091 1.051954 -0.117774
C  4.038241 0.95235 0.84459
C  6.441482 2.288893 0.470754
C  4.230234 2.191982 1.429922
C  5.434226 2.852226 1.237663
C  2.98751 -3.752242 0.22681
C  1.619905 -3.134521 0.25028
C  1.001689 -2.726436 -0.929833
C  0.945541 -2.926329 1.443263
C  -0.910653 -1.912198 0.3035
C  -0.239856 -2.123684 -0.905333
C  -0.309698 -2.332527 1.487276
C  -2.950007 -0.866816 1.215414
C  -5.879542 0.813887 -0.457323
C  -4.563365 0.113407 -0.425752
C  -5.993365 2.074932 -1.024922
C  -7.046228 0.222061 0.00267
C  -7.19883 2.734838 -1.129295
C  -8.27699 0.836808 -0.088789
C  -8.33905 2.100003 -0.657916
H  6.235333 -2.061839 -1.78526
H  3.53141 -1.147394 -2.965806
H  4.764235 -2.224246 -3.761648
H  6.472092 -0.357311 -3.5673
H  5.207985 0.691022 -2.785023
H  7.023936 0.619864 -0.715747
H  3.09241 0.446083 0.986616
H  7.381627 2.804187 0.327281
H  3.442683 2.639304 2.021383
H  2.979198 -4.711962 -0.294203
H  3.345313 -3.931571 1.245543
H  1.492432 -2.873051 -1.884842
H  1.405793 -3.2293 2.376481
H  -0.69696 -1.80523 -1.835389
H  -0.789152 -2.197287 2.442511
H  -2.45914 -1.040125 -0.727206
H  -4.674092 0.119075 1.608425
H  -7.24563 3.722365 -1.568024
H  -9.165784 0.338097 0.273378
H  -9.294471 2.600456 -0.735982
elementType: Cl F O N C H
totalener: -2014.66600607 hartree
nucrepener: 3330.90288480 hartree
electener: -5345.56889087 hartree
oneelecener: -9381.74459842 hartree
twoeener: 4036.17570755 hartree
cpcmener: -0.04034986 hartree
kineticenergy: 2007.67243298 hartree
xcener: -167.135672097442 hartree
chargesum: -0.0000000
charge: -0.095592 -0.201933 -0.206564 -0.220221 -0.493359 -0.446246 -0.158333 -0.174384 -0.154400 -0.080589 -0.175663 -0.186362 0.202661 0.050977 -0.225223 -0.207210 -0.143103 -0.153041 0.104710 0.093325 -0.032989 -0.190830 -0.156934 0.183227 -0.200065 -0.215192 0.418436 -0.128279 0.396291 0.303425 0.310299 -0.244819 -0.244146 -0.063715 0.113930 0.089392 0.096451 0.096067 0.102360 0.157479 0.139440 0.141628 0.142819 0.111016 0.097997 0.145051 0.140011 0.140526 0.156888 0.198670 0.194446 0.152383 0.152714 0.166575
qa: -0.0956 -0.2019 -0.2066 -0.2202 -0.4934 -0.4462 -0.1583 -0.1744 -0.1544 -0.0806 -0.1757 -0.1864 0.2027 0.0510 -0.2252 -0.2072 -0.1431 -0.1530 0.1047 0.0933 -0.0330 -0.1908 -0.1569 0.1832 -0.2001 -0.2152 0.4184 -0.1283 0.3963 0.3034 0.3103 -0.2448 -0.2441 -0.0637 0.1139 0.0894 0.0965 0.0961 0.1024 0.1575 0.1394 0.1416 0.1428 0.1110 0.0980 0.1451 0.1400 0.1405 0.1569 0.1987 0.1944 0.1524 0.1527 0.1666
va: 1.2095 1.0975 1.0883 1.9667 2.0192 2.0687 2.9107 3.2537 3.2093 3.8091 3.9107 3.9267 3.7641 3.5767 3.9884 4.0341 3.9874 4.0070 3.8370 3.8452 3.6522 3.9692 3.9892 3.8254 3.9661 3.9662 4.3169 3.5486 4.0830 3.9575 3.9339 3.9614 3.9632 3.8092 1.0069 1.0171 1.0150 1.0163 1.0072 0.9940 1.0162 1.0070 1.0069 0.9935 1.0083 1.0064 1.0029 1.0088 1.0311 1.0418 1.0074 1.0009 1.0007 0.9848
dispcorr: -0.025695458 hartree
energy: -2014.691701528855
dipole: 23.85903 -25.77330 -1.91428 -18.50821 18.89364 0.38543 -12.45339 11.15855 -1.29483
magnitude: 2.34299 au
magnitude: 5.95541 debye
