program: Orca
programVersion: 5.0.2
elementType: Cl F F O O O N N N C C C C C C C C C C C C C C C C C C C C C C C C C H H H H H H H H H H H H H H H H H H H H
charge: 0
multiplicity: 1
keywords: wb97x-d3
keywords: def2-TZVPP
keywords: def2/J RIJCOSX
keywords: DEFGRID2
keywords: scfconv7
keywords: smallprint printgap noloewdin
keywords: NOSOSCF
formula: C25H20ClF2N3O3
InChI: InChI=1/C25H20ClF2N3O3/c26-18-10-8-17(9-11-18)23(16-6-7-16)31-34-14-15-4-12-19(13-5-15)29-25(33)30-24(32)22-20(27)2-1-3-21(22)28/h1-5,8-13,16,29-30H,6-7,14H2
54 atoms
Cl 6.136245 4.670645 0.862786
F  -7.185135 -0.968863 1.339361
F  -5.329028 2.48193 -1.209577
O  3.880298 -2.950182 0.332276
O  -2.523061 -1.030661 -2.110707
O  -4.429052 -0.022394 1.423051
N  4.112393 -1.63251 0.592218
N  -2.248618 -1.034534 0.158741
N  -4.193611 -0.230355 -0.834605
C  5.698261 -1.870741 -1.238932
C  4.963626 -2.23496 -2.49862
C  6.069019 -1.232871 -2.541461
C  4.984966 -1.11276 -0.178198
C  5.263706 0.317216 0.059894
C  4.259643 1.17401 0.511426
C  6.54177 0.835605 -0.140196
C  4.521084 2.510483 0.75908
C  6.819233 2.169566 0.111384
C  5.803423 2.998637 0.558868
C  2.839531 -3.424209 1.167176
C  1.513746 -2.782256 0.870168
C  1.091558 -2.567634 -0.436853
C  0.66363 -2.398423 1.899391
C  -0.987337 -1.619812 0.318893
C  -0.136406 -1.990743 -0.722921
C  -0.570297 -1.833043 1.632962
C  -2.91535 -0.79735 -0.985236
C  -6.206981 0.724857 0.059767
C  -4.859081 0.128768 0.296147
C  -7.335763 0.153094 0.63381
C  -6.399237 1.888771 -0.672184
C  -8.598655 0.682882 0.476339
C  -7.640568 2.464493 -0.844196
C  -8.738361 1.845761 -0.266625
H  6.377418 -2.628982 -0.8625
H  3.95099 -1.870295 -2.616489
H  5.132354 -3.221331 -2.910388
H  7.012594 -1.520406 -2.986437
H  5.800578 -0.196095 -2.700045
H  3.255184 0.800065 0.658179
H  7.3420 0.19479 -0.486291
H  3.728337 3.163636 1.097485
H  7.818791 2.553264 -0.04154
H  2.803138 -4.498692 0.972562
H  3.100126 -3.290493 2.222289
H  1.727295 -2.850823 -1.266947
H  0.965571 -2.539555 2.930285
H  -0.412192 -1.839086 -1.753037
H  -1.21317 -1.546032 2.456499
H  -2.735935 -0.7940 1.016844
H  -4.670668 -0.107113 -1.719939
H  -9.453765 0.195506 0.924342
H  -7.74306 3.377799 -1.414214
H  -9.720791 2.278547 -0.395798
elementType: Cl F O N C H
totalener: -2014.66612579 hartree
nucrepener: 3305.75820350 hartree
electener: -5320.42432929 hartree
oneelecener: -9331.50713392 hartree
twoeener: 4011.08280463 hartree
cpcmener: -0.04030298 hartree
kineticenergy: 2007.65820981 hartree
xcener: -167.133812744481 hartree
chargesum: -0.0000000
charge: -0.095329 -0.201424 -0.206222 -0.221414 -0.493914 -0.447547 -0.158140 -0.172964 -0.154261 -0.079968 -0.176601 -0.185852 0.205221 0.051373 -0.209342 -0.225485 -0.151948 -0.143217 0.102931 0.100282 -0.021154 -0.204688 -0.154336 0.177187 -0.207518 -0.204547 0.417108 -0.127934 0.397321 0.299720 0.309034 -0.241543 -0.241554 -0.064914 0.112325 0.090812 0.096794 0.096437 0.102456 0.139002 0.158055 0.142695 0.142579 0.107763 0.097613 0.143240 0.141335 0.156259 0.141155 0.197896 0.193778 0.151969 0.152732 0.166745
qa: -0.0953 -0.2014 -0.2062 -0.2214 -0.4939 -0.4475 -0.1581 -0.1730 -0.1543 -0.0800 -0.1766 -0.1859 0.2052 0.0514 -0.2093 -0.2255 -0.1519 -0.1432 0.1029 0.1003 -0.0212 -0.2047 -0.1543 0.1772 -0.2075 -0.2045 0.4171 -0.1279 0.3973 0.2997 0.3090 -0.2415 -0.2416 -0.0649 0.1123 0.0908 0.0968 0.0964 0.1025 0.1390 0.1581 0.1427 0.1426 0.1078 0.0976 0.1432 0.1413 0.1563 0.1412 0.1979 0.1938 0.1520 0.1527 0.1667
va: 1.2101 1.0979 1.0885 1.9727 2.0185 2.0665 2.9144 3.2531 3.2096 3.8111 3.9091 3.9263 3.7623 3.5810 4.0373 3.9864 4.0056 3.9892 3.8406 3.8383 3.6524 3.9929 3.9755 3.8287 3.9832 3.9530 4.3192 3.5474 4.0814 3.9602 3.9333 3.9594 3.9598 3.8113 1.0079 1.0168 1.0152 1.0162 1.0074 1.0190 0.9937 1.0071 1.0069 0.9928 1.0108 1.0103 1.0006 1.0323 1.0078 1.0415 1.0080 1.0010 1.0008 0.9848
dispcorr: -0.025475368 hartree
energy: -2014.691601157330
dipole: 24.90411 -26.89302 -1.98891 -21.31298 21.28196 -0.03102 -7.90244 7.43784 -0.46460
magnitude: 2.04269 au
magnitude: 5.19210 debye
