program: Orca
programVersion: 5.0.2
elementType: Cl F F O O O N N N C C C C C C C C C C C C C C C C C C C C C C C C C H H H H H H H H H H H H H H H H H H H H
charge: 0
multiplicity: 1
keywords: wb97x-d3
keywords: def2-TZVPP
keywords: def2/J RIJCOSX
keywords: DEFGRID2
keywords: scfconv7
keywords: smallprint printgap noloewdin
keywords: NOSOSCF
formula: C25H20ClF2N3O3
InChI: InChI=1/C25H20ClF2N3O3/c26-18-10-8-17(9-11-18)23(16-6-7-16)31-34-14-15-4-12-19(13-5-15)29-25(33)30-24(32)22-20(27)2-1-3-21(22)28/h1-5,8-13,16,29-30H,6-7,14H2
54 atoms
Cl 5.678659 4.43038 1.796195
F  -5.048025 2.149005 -2.052029
F  -6.824973 -0.673818 1.215678
O  3.908363 -2.992669 -0.497242
O  -2.427741 -0.465163 2.439238
O  -4.110306 -0.516608 -1.339205
N  4.090496 -1.775549 0.083191
N  -2.090928 -1.238395 0.31457
N  -3.975019 0.006203 0.874401
C  5.316014 -1.320935 -1.971436
C  4.374442 -1.505274 -3.126773
C  5.308681 -0.34048 -3.102502
C  4.764797 -0.967122 -0.636382
C  4.982739 0.370175 -0.048402
C  4.053703 0.921647 0.835856
C  6.129315 1.102564 -0.35021
C  4.26095 2.166163 1.404183
C  6.353582 2.34663 0.21822
C  5.414315 2.87022 1.091553
C  3.016878 -3.771411 0.291585
C  1.648517 -3.16101 0.344737
C  0.90044 -3.000328 -0.819538
C  1.11825 -2.677054 1.530861
C  -0.849702 -1.87503 0.408776
C  -0.325859 -2.367862 -0.790809
C  -0.119249 -2.047113 1.582361
C  -2.766877 -0.58717 1.279279
C  -5.881831 0.72698 -0.397448
C  -4.575702 0.007892 -0.3465
C  -6.07701 1.770047 -1.293476
C  -6.97226 0.354431 0.375416
C  -7.277788 2.436928 -1.4073
C  -8.195184 0.986054 0.29348
C  -8.334375 2.033735 -0.603929
H  6.153031 -2.012231 -1.938243
H  3.323218 -1.30673 -2.957737
H  4.570715 -2.322475 -3.80897
H  6.159607 -0.342925 -3.771491
H  4.882335 0.639815 -2.92797
H  3.147155 0.381034 1.074783
H  6.869893 0.701744 -1.029861
H  3.524965 2.583169 2.078498
H  7.253382 2.897085 -0.021356
H  3.000689 -4.745573 -0.200633
H  3.419644 -3.911861 1.299307
H  1.278852 -3.36872 -1.766057
H  1.681391 -2.785205 2.450396
H  -0.886384 -2.247044 -1.710744
H  -0.485439 -1.692245 2.531583
H  -2.511028 -1.227314 -0.609956
H  -4.424252 0.523264 1.620956
H  -7.383492 3.254117 -2.107968
H  -9.019459 0.661687 0.914143
H  -9.284555 2.544214 -0.680942
elementType: Cl F O N C H
totalener: -2014.66619147 hartree
nucrepener: 3338.63358107 hartree
electener: -5353.29977254 hartree
oneelecener: -9397.26455300 hartree
twoeener: 4043.96478046 hartree
cpcmener: -0.04016811 hartree
kineticenergy: 2007.66000394 hartree
xcener: -167.133385323374 hartree
chargesum: -0.0000000
charge: -0.095879 -0.201296 -0.206260 -0.222063 -0.493822 -0.446662 -0.150144 -0.174833 -0.156706 -0.079902 -0.173353 -0.190807 0.197009 0.045803 -0.206643 -0.224017 -0.151908 -0.144193 0.104713 0.088213 -0.038401 -0.184435 -0.164510 0.191968 -0.198910 -0.214989 0.418643 -0.125456 0.397908 0.301194 0.308950 -0.243857 -0.244133 -0.062963 0.115126 0.088866 0.096063 0.095945 0.103319 0.144056 0.157982 0.142085 0.141905 0.113869 0.098018 0.143964 0.139933 0.140365 0.154511 0.199230 0.194057 0.152459 0.153377 0.166611
qa: -0.0959 -0.2013 -0.2063 -0.2221 -0.4938 -0.4467 -0.1501 -0.1748 -0.1567 -0.0799 -0.1734 -0.1908 0.1970 0.0458 -0.2066 -0.2240 -0.1519 -0.1442 0.1047 0.0882 -0.0384 -0.1844 -0.1645 0.1920 -0.1989 -0.2150 0.4186 -0.1255 0.3979 0.3012 0.3090 -0.2439 -0.2441 -0.0630 0.1151 0.0889 0.0961 0.0959 0.1033 0.1441 0.1580 0.1421 0.1419 0.1139 0.0980 0.1440 0.1399 0.1404 0.1545 0.1992 0.1941 0.1525 0.1534 0.1666
va: 1.2092 1.0982 1.0886 1.9664 2.0187 2.0678 2.9132 3.2525 3.2106 3.8042 3.9142 3.9256 3.7737 3.5881 4.0358 3.9910 4.0101 3.9888 3.8348 3.8570 3.6366 3.9719 3.9662 3.8127 3.9562 3.9681 4.3175 3.5477 4.0794 3.9600 3.9319 3.9590 3.9611 3.8107 1.0056 1.0174 1.0149 1.0164 1.0072 1.0107 0.9934 1.0075 1.0071 0.9939 1.0072 1.0059 1.0049 1.0085 1.0315 1.0415 1.0078 1.0009 1.0006 0.9848
dispcorr: -0.025776298 hartree
energy: -2014.691967771204
dipole: 23.19610 -25.23132 -2.03522 -18.47297 18.81449 0.34152 -12.48949 11.18679 -1.30270
magnitude: 2.44045 au
magnitude: 6.20313 debye
