program: Orca
programVersion: 5.0.2
elementType: Cl F F O O O N N N C C C C C C C C C C C C C C C C C C C C C C C C C H H H H H H H H H H H H H H H H H H H H
charge: 0
multiplicity: 1
keywords: wb97x-d3
keywords: def2-TZVPP
keywords: def2/J RIJCOSX
keywords: DEFGRID2
keywords: scfconv7
keywords: smallprint printgap noloewdin
keywords: NOSOSCF
formula: C25H20ClF2N3O3
InChI: InChI=1/C25H20ClF2N3O3/c26-18-10-8-17(9-11-18)23(16-6-7-16)31-34-14-15-4-12-19(13-5-15)29-25(33)30-24(32)22-20(27)2-1-3-21(22)28/h1-5,8-13,16,29-30H,6-7,14H2
54 atoms
Cl 10.998767 0.432634 0.30747
F  -7.949051 1.095357 -1.467163
F  -6.875587 -1.074994 2.524403
O  3.049135 0.365402 -0.290063
O  -3.892904 -1.015464 -2.346884
O  -5.248604 0.959654 1.032159
N  4.393591 0.484529 -0.398041
N  -3.196276 0.355824 -0.647977
N  -5.405479 -0.365835 -0.814172
C  4.375294 -0.830266 1.654827
C  3.526173 -2.030488 1.370087
C  4.835956 -2.198542 2.065857
C  5.034875 -0.101651 0.536143
C  6.505652 0.011827 0.474692
C  7.151779 0.351305 -0.715996
C  7.286277 -0.190487 1.610468
C  8.525861 0.481715 -0.771826
C  8.665224 -0.058046 1.568773
C  9.279525 0.275658 0.374641
C  2.417776 1.032324 -1.372775
C  0.940229 0.853654 -1.214151
C  0.262454 1.431013 -0.1442
C  0.206112 0.095296 -2.112492
C  -1.826962 0.485493 -0.900811
C  -1.096543 1.251344 0.011579
C  -1.161791 -0.091964 -1.978646
C  -4.094085 -0.372347 -1.346012
C  -7.359671 0.023375 0.522098
C  -5.901696 0.267244 0.284635
C  -8.337445 0.478284 -0.34979
C  -7.790927 -0.60733 1.681398
C  -9.686042 0.324446 -0.100514
C  -9.128413 -0.791564 1.966903
C  -10.069715 -0.31568 1.067038
H  4.017085 -0.183638 2.451185
H  3.450636 -2.364451 0.344235
H  2.610864 -2.143284 1.935141
H  4.840789 -2.437399 3.121587
H  5.649366 -2.647474 1.509567
H  6.565483 0.512714 -1.609818
H  6.817762 -0.449927 2.550015
H  9.012162 0.738795 -1.702709
H  9.255524 -0.213626 2.461063
H  2.690049 2.093267 -1.363278
H  2.755032 0.615351 -2.327082
H  0.801992 2.027451 0.581014
H  0.708881 -0.370976 -2.95125
H  -1.600935 1.709132 0.854849
H  -1.691748 -0.685761 -2.704093
H  -3.552068 0.826324 0.177077
H  -6.034356 -0.936438 -1.359046
H  -10.413997 0.702572 -0.804218
H  -9.421937 -1.297612 2.875788
H  -11.121503 -0.447779 1.27924
totalener: -2014.63107977 hartree
nucrepener: 3187.56056338 hartree
electener: -5202.19164315 hartree
oneelecener: -9093.88319222 hartree
twoeener: 3891.69154907 hartree
kineticenergy: 2007.71830488 hartree
xcener: -167.136341334213 hartree
chargesum: -0.0000000
charge: -0.080492 -0.187568 -0.179267 -0.182629 -0.403951 -0.374962 -0.123905 -0.190054 -0.175551 -0.077553 -0.124700 -0.174974 0.181570 0.009999 -0.165966 -0.195068 -0.126410 -0.134135 0.099867 0.079657 -0.070610 -0.132185 -0.081303 0.186280 -0.180190 -0.194780 0.391578 -0.154070 0.376247 0.280888 0.295319 -0.227422 -0.225851 -0.043347 0.099299 0.074771 0.078207 0.081931 0.092844 0.119476 0.134496 0.118939 0.117364 0.090604 0.070197 0.114780 0.109537 0.107854 0.151400 0.175592 0.167488 0.132062 0.131146 0.137552
qa: -0.0805 -0.1876 -0.1793 -0.1826 -0.4040 -0.3750 -0.1239 -0.1901 -0.1756 -0.0776 -0.1247 -0.1750 0.1816 0.0100 -0.1660 -0.1951 -0.1264 -0.1341 0.0999 0.0797 -0.0706 -0.1322 -0.0813 0.1863 -0.1802 -0.1948 0.3916 -0.1541 0.3762 0.2809 0.2953 -0.2274 -0.2259 -0.0433 0.0993 0.0748 0.0782 0.0819 0.0928 0.1195 0.1345 0.1189 0.1174 0.0906 0.0702 0.1148 0.1095 0.1079 0.1514 0.1756 0.1675 0.1321 0.1311 0.1376
va: 1.2268 1.1108 1.1302 2.0114 2.1075 2.1382 2.9286 3.2618 3.1956 3.8277 3.9366 3.9112 3.7843 3.7697 4.0411 4.0023 4.0092 4.0343 3.9211 3.8935 3.8470 4.0288 3.9458 3.8962 3.9928 4.0292 4.3166 3.5790 4.0927 3.9871 4.0056 3.9967 3.9943 3.8467 1.0077 1.0281 1.0213 1.0187 1.0122 1.0374 1.0013 1.0143 1.0151 0.9957 1.0052 1.0138 1.0097 1.0168 1.0329 1.0666 1.0274 1.0086 1.0088 0.9957
dispcorr: -0.024115158 hartree
energy: -2014.655194931298
dipole: 13.31195 -15.96222 -2.65027 -5.87278 5.52447 -0.34831 2.43870 -1.68083 0.75787
magnitude: 2.77842 au
magnitude: 7.06218 debye
