program: Orca
programVersion: 5.0.2
elementType: Cl F F O O O N N N C C C C C C C C C C C C C C C C C C C C C C C C C H H H H H H H H H H H H H H H H H H H H
charge: 0
multiplicity: 1
keywords: wb97x-d3
keywords: def2-TZVPP
keywords: def2/J RIJCOSX
keywords: DEFGRID2
keywords: scfconv7
keywords: smallprint printgap noloewdin
keywords: NOSOSCF
formula: C25H20ClF2N3O3
InChI: InChI=1/C25H20ClF2N3O3/c26-18-10-8-17(9-11-18)23(16-6-7-16)31-34-14-15-4-12-19(13-5-15)29-25(33)30-24(32)22-20(27)2-1-3-21(22)28/h1-5,8-13,16,29-30H,6-7,14H2
54 atoms
Cl 5.744067 4.783772 0.041355
F  -7.120654 -0.678929 1.150027
F  -5.143036 2.055808 -2.074664
O  3.818695 -2.945213 0.228583
O  -2.865776 -0.328627 2.718535
O  -4.197176 -0.547118 -1.196545
N  4.056356 -1.620746 0.407289
N  -2.276146 -1.094769 0.63979
N  -4.27048 0.049493 1.001143
C  5.293574 -1.862755 -1.678763
C  6.719036 -1.715275 -2.123522
C  6.271829 -2.977937 -1.465879
C  4.774833 -1.101735 -0.508415
C  5.042267 0.343192 -0.366413
C  4.909771 0.979536 0.869186
C  5.391738 1.116012 -1.471079
C  5.12477 2.337901 0.999284
C  5.603804 2.480509 -1.354896
C  5.471607 3.085077 -0.117246
C  2.912487 -3.397867 1.214242
C  1.546462 -2.785719 1.082943
C  0.948214 -2.621488 -0.161822
C  0.839991 -2.375963 2.202304
C  -1.012614 -1.652015 0.862072
C  -0.307925 -2.060949 -0.271744
C  -0.428152 -1.820472 2.113573
C  -3.072193 -0.479364 1.538751
C  -6.080923 0.66708 -0.450757
C  -4.762531 -0.01481 -0.267403
C  -7.222233 0.297696 0.245965
C  -6.220195 1.671911 -1.399873
C  -8.449741 0.891088 0.03305
C  -7.425048 2.300989 -1.638005
C  -8.537259 1.898327 -0.914816
H  4.558338 -2.028498 -2.4614
H  7.36055 -1.050882 -1.558232
H  6.923399 -1.725181 -3.186362
H  6.157039 -3.870374 -2.066121
H  6.607291 -3.168711 -0.45532
H  4.633023 0.398528 1.737783
H  5.492942 0.655432 -2.444314
H  5.024285 2.815934 1.96381
H  5.867912 3.067672 -2.223358
H  2.872066 -4.47964 1.066671
H  3.312321 -3.215602 2.217302
H  1.470981 -2.920953 -1.061431
H  1.288225 -2.480533 3.183476
H  -0.747867 -1.929549 -1.253824
H  -0.93891 -1.511316 3.010245
H  -2.617109 -1.110723 -0.315432
H  -4.814627 0.52901 1.7023
H  -9.314079 0.565611 0.594488
H  -7.486315 3.088898 -2.375477
H  -9.489457 2.378071 -1.093522
totalener: -2014.63054321 hartree
nucrepener: 3300.82321041 hartree
electener: -5315.45375362 hartree
oneelecener: -9320.80472679 hartree
twoeener: 4005.35097318 hartree
kineticenergy: 2007.73091251 hartree
xcener: -167.140857168222 hartree
chargesum: -0.0000000
charge: -0.080968 -0.188519 -0.176537 -0.194628 -0.405394 -0.376529 -0.132723 -0.192870 -0.176048 -0.075611 -0.174674 -0.127898 0.185004 0.019826 -0.156900 -0.198337 -0.126511 -0.134020 0.099395 0.081221 0.004075 -0.172460 -0.118812 0.167956 -0.167106 -0.177822 0.390207 -0.150661 0.376315 0.277085 0.289916 -0.225130 -0.221444 -0.044820 0.098284 0.093853 0.082220 0.075829 0.075935 0.118184 0.135155 0.118521 0.117290 0.094243 0.081207 0.111549 0.104854 0.107074 0.147676 0.176219 0.166524 0.132338 0.130641 0.137828
qa: -0.0810 -0.1885 -0.1765 -0.1946 -0.4054 -0.3765 -0.1327 -0.1929 -0.1760 -0.0756 -0.1747 -0.1279 0.1850 0.0198 -0.1569 -0.1983 -0.1265 -0.1340 0.0994 0.0812 0.0041 -0.1725 -0.1188 0.1680 -0.1671 -0.1778 0.3902 -0.1507 0.3763 0.2771 0.2899 -0.2251 -0.2214 -0.0448 0.0983 0.0939 0.0822 0.0758 0.0759 0.1182 0.1352 0.1185 0.1173 0.0942 0.0812 0.1115 0.1049 0.1071 0.1477 0.1762 0.1665 0.1323 0.1306 0.1378
va: 1.2261 1.1097 1.1342 1.9951 2.1065 2.1354 2.8971 3.2581 3.1971 3.8329 3.9177 3.9358 3.7608 3.7561 4.0400 4.0010 4.0105 4.0343 3.9217 3.8869 3.7197 4.0570 4.0065 3.9098 3.9957 4.0249 4.3196 3.5771 4.0937 3.9815 4.0090 3.9929 3.9916 3.8497 1.0069 1.0127 1.0190 1.0211 1.0261 1.0382 1.0002 1.0145 1.0152 0.9903 1.0097 1.0223 1.0112 1.0166 1.0325 1.0671 1.0291 1.0085 1.0089 0.9956
dispcorr: -0.024894505 hartree
energy: -2014.655437710627
dipole: 28.18886 -29.70868 -1.51981 -22.75639 22.69519 -0.06120 -3.84273 3.03783 -0.80490
magnitude: 1.72088 au
magnitude: 4.37414 debye
