program: Orca
programVersion: 5.0.2
elementType: Cl F F O O O N N N C C C C C C C C C C C C C C C C C C C C C C C C C H H H H H H H H H H H H H H H H H H H H
charge: 0
multiplicity: 1
keywords: wb97x-d3
keywords: def2-TZVPP
keywords: def2/J RIJCOSX
keywords: DEFGRID2
keywords: scfconv7
keywords: smallprint printgap noloewdin
keywords: NOSOSCF
formula: C25H20ClF2N3O3
InChI: InChI=1/C25H20ClF2N3O3/c26-18-10-8-17(9-11-18)23(16-6-7-16)31-34-14-15-4-12-19(13-5-15)29-25(33)30-24(32)22-20(27)2-1-3-21(22)28/h1-5,8-13,16,29-30H,6-7,14H2
54 atoms
Cl 6.304276 4.584496 -0.627924
F  -4.981023 2.380509 1.400253
F  -7.154528 -1.334825 -0.371995
O  3.892058 -2.996749 -0.269086
O  -2.335458 0.52191 -2.257103
O  -4.322426 -1.03415 1.036379
N  4.183498 -1.697971 -0.524797
N  -2.128289 -1.0215 -0.574436
N  -4.029577 0.301345 -0.789702
C  5.251659 -1.819426 1.659972
C  5.126255 -1.139025 2.990635
C  4.196582 -2.251034 2.633145
C  4.842006 -1.129423 0.406228
C  5.194239 0.283118 0.166068
C  6.314597 0.853066 0.764883
C  4.420509 1.076657 -0.682118
C  6.665421 2.171119 0.521278
C  4.756484 2.394476 -0.928165
C  5.881632 2.936574 -0.324858
C  2.977499 -3.472269 -1.243695
C  1.625652 -2.835753 -1.112365
C  0.748351 -3.22616 -0.106474
C  1.232003 -1.802751 -1.950568
C  -0.867536 -1.57789 -0.81077
C  -0.478332 -2.611002 0.043943
C  0.004103 -1.172346 -1.818723
C  -2.74898 -0.052567 -1.280013
C  -6.033967 0.51055 0.499542
C  -4.712133 -0.163242 0.293027
C  -6.119251 1.764835 1.079666
C  -7.222195 -0.129014 0.186835
C  -7.326751 2.38331 1.332442
C  -8.453324 0.450596 0.416987
C  -8.491284 1.711363 0.99348
H  6.085878 -2.504873 1.542371
H  4.725108 -0.133549 3.010749
H  5.896684 -1.320995 3.728594
H  4.318632 -3.212233 3.114222
H  3.169064 -1.998877 2.40538
H  6.932765 0.261437 1.426834
H  3.538475 0.655935 -1.145424
H  7.542548 2.597869 0.987309
H  4.143148 3.001159 -1.579791
H  3.382118 -3.316041 -2.248205
H  2.922452 -4.547713 -1.066079
H  1.023014 -4.024998 0.572127
H  1.903771 -1.471964 -2.733034
H  -1.146542 -2.938205 0.832323
H  -0.262688 -0.377346 -2.494922
H  -2.643147 -1.390234 0.217785
H  -4.464185 1.021658 -1.346795
H  -7.351305 3.363191 1.787693
H  -9.359044 -0.076043 0.151169
H  -9.447595 2.178853 1.182298
totalener: -2014.63134017 hartree
nucrepener: 3325.08655301 hartree
electener: -5339.71789317 hartree
oneelecener: -9369.12764495 hartree
twoeener: 4029.40975178 hartree
kineticenergy: 2007.74361229 hartree
xcener: -167.140665825871 hartree
chargesum: -0.0000000
charge: -0.081436 -0.186165 -0.182654 -0.189927 -0.402646 -0.373092 -0.115434 -0.188917 -0.171472 -0.072158 -0.171644 -0.129005 0.166074 0.022571 -0.198298 -0.158801 -0.128784 -0.129302 0.101369 0.063640 -0.043014 -0.157253 -0.116436 0.182793 -0.172893 -0.176346 0.387655 -0.159487 0.368604 0.293950 0.309980 -0.236764 -0.238538 -0.040891 0.098393 0.093350 0.080268 0.075312 0.073215 0.132327 0.124690 0.116622 0.117215 0.088001 0.095123 0.111909 0.115973 0.108794 0.149688 0.175430 0.167741 0.131818 0.131091 0.137761
qa: -0.0814 -0.1862 -0.1827 -0.1899 -0.4026 -0.3731 -0.1154 -0.1889 -0.1715 -0.0722 -0.1716 -0.1290 0.1661 0.0226 -0.1983 -0.1588 -0.1288 -0.1293 0.1014 0.0636 -0.0430 -0.1573 -0.1164 0.1828 -0.1729 -0.1763 0.3877 -0.1595 0.3686 0.2939 0.3100 -0.2368 -0.2385 -0.0409 0.0984 0.0934 0.0803 0.0753 0.0732 0.1323 0.1247 0.1166 0.1172 0.0880 0.0951 0.1119 0.1160 0.1088 0.1497 0.1754 0.1677 0.1318 0.1311 0.1378
va: 1.2254 1.1137 1.1239 1.9990 2.1101 2.1378 2.9173 3.2583 3.1912 3.8298 3.9209 3.9344 3.8124 3.7051 3.9979 4.0429 4.0230 4.0180 3.9076 3.9046 3.7003 4.0306 3.9458 3.8986 3.9919 4.0053 4.3170 3.5805 4.0957 3.9966 3.9995 4.0060 4.0053 3.8404 1.0065 1.0116 1.0193 1.0195 1.0250 1.0011 1.0171 1.0150 1.0154 1.0098 0.9962 1.0124 1.0157 1.0159 1.0318 1.0677 1.0254 1.0084 1.0088 0.9954
dispcorr: -0.025789688 hartree
energy: -2014.657129854839
dipole: 21.58485 -23.44408 -1.85923 -20.40519 20.24286 -0.16233 7.68003 -6.81539 0.86464
magnitude: 2.05687 au
magnitude: 5.22814 debye
