program: Orca
programVersion: 5.0.2
elementType: Cl F F O O O N N N C C C C C C C C C C C C C C C C C C C C C C C C C H H H H H H H H H H H H H H H H H H H H
charge: 0
multiplicity: 1
keywords: wb97x-d3
keywords: def2-TZVPP
keywords: def2/J RIJCOSX
keywords: DEFGRID2
keywords: scfconv7
keywords: smallprint printgap noloewdin
keywords: NOSOSCF
formula: C25H20ClF2N3O3
InChI: InChI=1/C25H20ClF2N3O3/c26-18-10-8-17(9-11-18)23(16-6-7-16)31-34-14-15-4-12-19(13-5-15)29-25(33)30-24(32)22-20(27)2-1-3-21(22)28/h1-5,8-13,16,29-30H,6-7,14H2
54 atoms
Cl -5.899668 -2.224385 -5.762534
F  5.883402 -2.083565 1.197926
F  6.431667 2.543834 1.556718
O  -4.262238 1.226802 -0.539245
O  2.303374 2.079617 3.257893
O  4.094401 -0.010225 0.162251
N  -4.352067 0.241739 0.412873
N  1.872347 1.162929 1.208123
N  3.983999 1.043997 2.180029
C  -4.684671 -2.049754 0.879787
C  -3.365945 -2.674181 1.271582
C  -4.176987 -1.933907 2.281301
C  -4.664029 -0.901676 -0.054975
C  -4.96755 -1.195461 -1.474287
C  -4.284646 -2.222417 -2.12157
C  -5.951617 -0.497843 -2.172331
C  -4.557904 -2.538037 -3.443255
C  -6.247019 -0.815002 -3.488012
C  -5.541095 -1.830122 -4.115037
C  -3.584708 2.345468 0.004349
C  -2.152664 2.042288 0.345063
C  -1.352405 1.287525 -0.510127
C  -1.586067 2.509536 1.521267
C  0.528773 1.495464 0.994702
C  -0.036471 1.01703 -0.191218
C  -0.261204 2.254423 1.854278
C  2.648939 1.473087 2.260315
C  6.099449 0.235878 1.388822
C  4.634854 0.407871 1.169427
C  6.680534 -1.02561 1.356044
C  6.956504 1.314931 1.558601
C  8.036232 -1.22348 1.504441
C  8.319714 1.168408 1.701422
C  8.84945 -0.112751 1.676529
H  -5.498856 -2.744492 0.707032
H  -2.466168 -2.198926 0.901148
H  -3.319226 -3.753785 1.326106
H  -4.697114 -2.508508 3.036275
H  -3.818044 -0.971598 2.618645
H  -3.521065 -2.78251 -1.597671
H  -6.516993 0.286671 -1.68774
H  -4.010412 -3.329734 -3.936108
H  -7.020873 -0.273527 -4.014805
H  -3.646061 3.10724 -0.775768
H  -4.111266 2.730469 0.883041
H  -1.754109 0.897667 -1.437387
H  -2.188291 3.089503 2.210515
H  0.566674 0.426403 -0.871035
H  0.124471 2.644277 2.781246
H  2.314748 0.627877 0.467239
H  4.52457 1.296015 2.998361
H  8.446228 -2.223874 1.486744
H  8.952196 2.036892 1.823608
H  9.915873 -0.248444 1.790348
elementType: Cl F O N C H
totalener: -2014.65124965 hartree
nucrepener: 3320.39005620 hartree
electener: -5335.04130584 hartree
oneelecener: -9360.81442494 hartree
twoeener: 4025.77311910 hartree
cpcmener: -0.04792633 hartree
kineticenergy: 2007.63905952 hartree
xcener: -167.131121213579 hartree
chargesum: -0.0000000
charge: -0.095162 -0.203965 -0.208209 -0.246806 -0.522635 -0.467827 -0.179276 -0.168288 -0.151405 -0.085174 -0.173353 -0.159676 0.238371 0.018037 -0.217775 -0.187413 -0.165345 -0.170050 0.118724 0.116447 -0.013375 -0.204451 -0.167978 0.181069 -0.199269 -0.214531 0.431590 -0.125588 0.407802 0.303571 0.308028 -0.242108 -0.240102 -0.066488 0.113265 0.094888 0.098404 0.101601 0.080838 0.164161 0.147041 0.143805 0.144719 0.108629 0.097530 0.136648 0.143571 0.143108 0.155944 0.202755 0.196420 0.154320 0.155399 0.169564
qa: -0.0952 -0.2040 -0.2082 -0.2468 -0.5226 -0.4678 -0.1793 -0.1683 -0.1514 -0.0852 -0.1734 -0.1597 0.2384 0.0180 -0.2178 -0.1874 -0.1653 -0.1700 0.1187 0.1164 -0.0134 -0.2045 -0.1680 0.1811 -0.1993 -0.2145 0.4316 -0.1256 0.4078 0.3036 0.3080 -0.2421 -0.2401 -0.0665 0.1133 0.0949 0.0984 0.1016 0.0808 0.1642 0.1470 0.1438 0.1447 0.1086 0.0975 0.1366 0.1436 0.1431 0.1559 0.2028 0.1964 0.1543 0.1554 0.1696
va: 1.2099 1.0941 1.0864 1.9339 1.9831 2.0413 2.9096 3.2591 3.2166 3.7742 3.9113 3.9273 3.7469 3.5686 4.0009 3.9927 4.0201 4.0031 3.8155 3.8222 3.6251 3.9699 3.9859 3.8146 3.9459 3.9617 4.3020 3.5484 4.0687 3.9527 3.9270 3.9549 3.9554 3.8096 1.0047 1.0145 1.0175 1.0157 1.0365 0.9896 1.0143 1.0079 1.0063 0.9941 1.0124 1.0155 1.0028 1.0077 1.0307 1.0358 1.0063 1.0002 0.9995 0.9837
dispcorr: -0.025685138 hartree
energy: -2014.676934784665
dipole: -20.27993 22.78211 2.50218 -0.88044 0.04699 -0.83345 13.20532 -12.68439 0.52093
magnitude: 2.68830 au
magnitude: 6.83311 debye
