program: Orca
programVersion: 5.0.2
elementType: Cl F F O O O N N N C C C C C C C C C C C C C C C C C C C C C C C C C H H H H H H H H H H H H H H H H H H H H
charge: 0
multiplicity: 1
keywords: wb97x-d3
keywords: def2-TZVPP
keywords: def2/J RIJCOSX
keywords: DEFGRID2
keywords: scfconv7
keywords: smallprint printgap noloewdin
keywords: NOSOSCF
formula: C25H20ClF2N3O3
InChI: InChI=1/C25H20ClF2N3O3/c26-18-10-8-17(9-11-18)23(16-6-7-16)31-34-14-15-4-12-19(13-5-15)29-25(33)30-24(32)22-20(27)2-1-3-21(22)28/h1-5,8-13,16,29-30H,6-7,14H2
54 atoms
Cl -3.114975 -5.335399 -1.179088
F  6.468096 3.123093 -0.308214
F  6.217153 -1.337085 1.039799
O  -4.207568 0.763472 0.071703
O  2.706228 3.012497 2.383746
O  4.143513 0.239904 -0.327333
N  -5.528852 0.925461 -0.262661
N  2.037059 1.532143 0.774846
N  4.284327 1.833221 1.295418
C  -7.487716 -0.07941 -1.062131
C  -7.99422 -0.863296 -2.244902
C  -8.41659 -1.249219 -0.872046
C  -6.068111 -0.155278 -0.671976
C  -5.333525 -1.438092 -0.790537
C  -4.577457 -1.706407 -1.927086
C  -5.385139 -2.379949 0.230822
C  -3.890466 -2.903783 -2.05206
C  -4.702578 -3.582031 0.118677
C  -3.962937 -3.832639 -1.025722
C  -3.640753 2.014004 0.416262
C  -2.156414 1.847055 0.554148
C  -1.44789 2.674306 1.415766
C  -1.436041 0.926337 -0.202632
C  0.645915 1.690061 0.765618
C  -0.065845 2.615195 1.526449
C  -0.060176 0.84566 -0.093018
C  2.942123 2.175317 1.531932
C  6.296674 0.898151 0.379139
C  4.807354 0.95437 0.401013
C  7.082084 1.977398 0.002025
C  6.955075 -0.288797 0.66796
C  8.456079 1.901976 -0.084664
C  8.326088 -0.411542 0.606541
C  9.068778 0.696894 0.2248
H  -7.92157 0.902816 -0.919499
H  -7.297993 -1.51049 -2.763277
H  -8.706408 -0.365209 -2.889198
H  -9.424694 -1.017433 -0.554994
H  -8.017023 -2.163738 -0.45322
H  -4.526077 -0.981234 -2.729272
H  -5.963766 -2.18221 1.123974
H  -3.308805 -3.106146 -2.940888
H  -4.751083 -4.309807 0.917118
H  -3.861254 2.752271 -0.362735
H  -4.067883 2.391336 1.351534
H  -1.981106 3.395559 2.023776
H  -1.937365 0.257017 -0.889682
H  0.428679 3.288334 2.206569
H  0.476141 0.1183 -0.690717
H  2.406096 0.842262 0.127065
H  4.932733 2.345191 1.880922
H  9.032106 2.763808 -0.392653
H  8.802512 -1.350768 0.852431
H  10.145289 0.618626 0.165403
elementType: Cl F O N C H
totalener: -2014.65169127 hartree
nucrepener: 3285.84117416 hartree
electener: -5300.49286542 hartree
oneelecener: -9291.66471543 hartree
twoeener: 3991.17185001 hartree
cpcmener: -0.04900620 hartree
kineticenergy: 2007.64573093 hartree
xcener: -167.132787067350 hartree
chargesum: -0.0000000
charge: -0.096182 -0.208548 -0.205243 -0.234415 -0.522530 -0.466212 -0.162205 -0.168022 -0.149238 -0.076705 -0.169844 -0.166811 0.234697 0.074602 -0.286863 -0.242139 -0.110699 -0.136772 0.084852 0.090736 -0.037330 -0.163258 -0.153130 0.188052 -0.225648 -0.224904 0.430629 -0.128359 0.405130 0.314560 0.307503 -0.244554 -0.247325 -0.066142 0.086610 0.098725 0.102224 0.102353 0.097987 0.150512 0.157807 0.147393 0.147025 0.095149 0.095807 0.142570 0.157066 0.157079 0.142211 0.202834 0.198509 0.155442 0.154985 0.170027
qa: -0.0962 -0.2085 -0.2052 -0.2344 -0.5225 -0.4662 -0.1622 -0.1680 -0.1492 -0.0767 -0.1698 -0.1668 0.2347 0.0746 -0.2869 -0.2421 -0.1107 -0.1368 0.0849 0.0907 -0.0373 -0.1633 -0.1531 0.1881 -0.2256 -0.2249 0.4306 -0.1284 0.4051 0.3146 0.3075 -0.2446 -0.2473 -0.0661 0.0866 0.0987 0.1022 0.1024 0.0980 0.1505 0.1578 0.1474 0.1470 0.0951 0.0958 0.1426 0.1571 0.1571 0.1422 0.2028 0.1985 0.1554 0.1550 0.1700
va: 1.2086 1.0858 1.0928 1.9521 1.9835 2.0439 2.9582 3.2569 3.2173 3.8800 3.8889 3.8926 3.7099 3.4304 3.9851 4.0120 3.9391 3.9647 3.8438 3.8898 3.7253 3.9991 3.9395 3.8047 3.9751 3.9937 4.3028 3.5497 4.0686 3.9278 3.9491 3.9576 3.9593 3.8058 1.0327 1.0145 1.0168 1.0165 1.0152 1.0079 1.0010 1.0022 1.0035 0.9975 0.9982 1.0043 0.9978 1.0307 1.0100 1.0368 1.0046 0.9996 0.9999 0.9835
dispcorr: -0.025153394 hartree
energy: -2014.676844660725
dipole: -40.98375 42.43908 1.45534 8.11890 -8.22849 -0.10958 -3.69352 3.04632 -0.64720
magnitude: 1.59652 au
magnitude: 4.05804 debye
