program: Orca
programVersion: 5.0.2
elementType: Cl F F O O O N N N C C C C C C C C C C C C C C C C C C C C C C C C C H H H H H H H H H H H H H H H H H H H H
charge: 0
multiplicity: 1
keywords: wb97x-d3
keywords: def2-TZVPP
keywords: def2/J RIJCOSX
keywords: DEFGRID2
keywords: scfconv7
keywords: smallprint printgap noloewdin
keywords: NOSOSCF
formula: C25H20ClF2N3O3
InChI: InChI=1/C25H20ClF2N3O3/c26-18-10-8-17(9-11-18)23(16-6-7-16)31-34-14-15-4-12-19(13-5-15)29-25(33)30-24(32)22-20(27)2-1-3-21(22)28/h1-5,8-13,16,29-30H,6-7,14H2
54 atoms
Cl -2.094097 -1.556852 -4.655026
F  4.849644 -1.25151 2.9449
F  5.802282 1.50205 -0.702116
O  -5.051337 1.350201 0.111099
O  1.370507 0.347353 -1.333481
O  3.439184 1.19735 2.143967
N  -5.124134 0.364756 1.084377
N  1.166286 1.404955 0.678464
N  3.153341 0.371597 0.038232
C  -4.832017 -1.895344 1.614739
C  -5.192457 -3.266301 1.100849
C  -3.832351 -3.021254 1.647868
C  -4.691558 -0.765553 0.678781
C  -4.065745 -0.981776 -0.649419
C  -4.836469 -1.20446 -1.784924
C  -2.680417 -0.941053 -0.763333
C  -4.234989 -1.386574 -3.020926
C  -2.066278 -1.116743 -1.993707
C  -2.85266 -1.33851 -3.112313
C  -4.422155 2.51209 0.637741
C  -2.933729 2.327107 0.669663
C  -2.275845 1.944655 1.832441
C  -2.194208 2.428315 -0.504737
C  -0.20155 1.72046 0.629093
C  -0.923688 1.643187 1.81614
C  -0.839771 2.142093 -0.534849
C  1.82603 0.706041 -0.262351
C  5.28151 0.13662 1.118092
C  3.876812 0.631592 1.159967
C  5.731261 -0.777387 2.061068
C  6.210793 0.605954 0.20148
C  7.033832 -1.225136 2.096106
C  7.527437 0.197634 0.203949
C  7.927028 -0.725199 1.159017
H  -5.265882 -1.615082 2.56681
H  -5.293417 -3.397813 0.030883
H  -5.89869 -3.834915 1.690807
H  -3.588246 -3.414759 2.625593
H  -3.0009 -2.997327 0.955926
H  -5.915921 -1.236219 -1.712396
H  -2.066394 -0.761327 0.110636
H  -4.84167 -1.556833 -3.899699
H  -0.98882 -1.070498 -2.071898
H  -4.702455 3.321913 -0.037108
H  -4.816579 2.74371 1.631563
H  -2.82311 1.86831 2.763994
H  -2.682573 2.737784 -1.421185
H  -0.427491 1.333854 2.728079
H  -0.294135 2.256405 -1.459605
H  1.6342 1.529747 1.569899
H  3.605283 -0.153575 -0.700684
H  7.343683 -1.948059 2.838119
H  8.224385 0.593446 -0.52204
H  8.954313 -1.061425 1.174487
elementType: Cl F O N C H
totalener: -2014.64949055 hartree
nucrepener: 3522.90088592 hartree
electener: -5537.55037647 hartree
oneelecener: -9766.09998580 hartree
twoeener: 4228.54960933 hartree
cpcmener: -0.04931571 hartree
kineticenergy: 2007.66203760 hartree
xcener: -167.132520941752 hartree
chargesum: 0.0000000
charge: -0.094796 -0.205105 -0.208253 -0.259791 -0.532371 -0.465627 -0.170376 -0.193928 -0.149355 -0.087405 -0.168245 -0.161954 0.241971 0.115477 -0.238161 -0.336594 -0.126628 -0.123189 0.071934 0.107974 -0.069338 -0.127116 -0.129403 0.215834 -0.221133 -0.254334 0.442856 -0.134375 0.415657 0.303260 0.316524 -0.245045 -0.245467 -0.065674 0.086187 0.098813 0.103057 0.103011 0.101334 0.149924 0.178551 0.145405 0.144108 0.111714 0.099457 0.142121 0.143528 0.146525 0.144325 0.204233 0.199732 0.154736 0.155304 0.170111
qa: -0.0948 -0.2051 -0.2083 -0.2598 -0.5324 -0.4656 -0.1704 -0.1939 -0.1494 -0.0874 -0.1682 -0.1620 0.2420 0.1155 -0.2382 -0.3366 -0.1266 -0.1232 0.0719 0.1080 -0.0693 -0.1271 -0.1294 0.2158 -0.2211 -0.2543 0.4429 -0.1344 0.4157 0.3033 0.3165 -0.2450 -0.2455 -0.0657 0.0862 0.0988 0.1031 0.1030 0.1013 0.1499 0.1786 0.1454 0.1441 0.1117 0.0995 0.1421 0.1435 0.1465 0.1443 0.2042 0.1997 0.1547 0.1553 0.1701
va: 1.2129 1.0930 1.0863 1.8830 1.9622 2.0406 2.8814 3.2214 3.2140 3.8737 3.8994 3.8878 3.6876 3.3822 3.9908 4.0056 3.9453 3.9446 3.8872 3.8465 3.6150 3.8822 3.8916 3.6260 4.0203 3.9609 4.2801 3.5443 4.0645 3.9504 3.9283 3.9576 3.9601 3.8067 1.0355 1.0145 1.0169 1.0165 1.0149 1.0063 0.9819 1.0038 1.0221 0.9961 1.0140 1.0095 1.0034 1.0075 1.0219 1.0363 1.0040 0.9999 0.9997 0.9834
dispcorr: -0.030401550 hartree
energy: -2014.679892099024
dipole: -28.43231 31.02857 2.59626 -4.31751 3.11069 -1.20682 12.55466 -11.50063 1.05403
magnitude: 3.05089 au
magnitude: 7.75475 debye
