program: Orca
programVersion: 5.0.2
elementType: Cl F F O O O N N N C C C C C C C C C C C C C C C C C C C C C C C C C H H H H H H H H H H H H H H H H H H H H
charge: 0
multiplicity: 1
keywords: wb97x-d3
keywords: def2-TZVPP
keywords: def2/J RIJCOSX
keywords: DEFGRID2
keywords: scfconv7
keywords: smallprint printgap noloewdin
keywords: NOSOSCF
formula: C25H20ClF2N3O3
InChI: InChI=1/C25H20ClF2N3O3/c26-18-10-8-17(9-11-18)23(16-6-7-16)31-34-14-15-4-12-19(13-5-15)29-25(33)30-24(32)22-20(27)2-1-3-21(22)28/h1-5,8-13,16,29-30H,6-7,14H2
54 atoms
Cl -2.737717 -1.072492 -5.221397
F  4.582504 -2.26681 1.730102
F  6.134943 2.07268 0.97559
O  -4.946065 1.23464 0.229567
O  2.045246 2.145988 -1.070378
O  3.191569 0.147659 2.359392
N  -4.940396 0.131521 1.06474
N  1.256996 1.389543 0.937874
N  3.464361 1.04436 0.283399
C  -4.587222 -2.17003 1.281565
C  -4.852869 -3.518429 0.666875
C  -3.480425 -3.181723 1.128685
C  -4.577479 -0.938115 0.471896
C  -4.126904 -0.983262 -0.941081
C  -2.814245 -0.65044 -1.260516
C  -5.004106 -1.347331 -1.955927
C  -2.379862 -0.676648 -2.576248
C  -4.581753 -1.379136 -3.27672
C  -3.271751 -1.040245 -3.573558
C  -4.362684 2.345926 0.904046
C  -2.869884 2.208304 0.950285
C  -2.24061 1.526073 1.9876
C  -2.084335 2.651064 -0.106166
C  -0.102472 1.714245 0.878592
C  -0.8808 1.279995 1.954365
C  -0.716514 2.422167 -0.15398
C  2.19725 1.577096 -0.00536
C  5.306754 -0.080919 1.343242
C  3.892558 0.383786 1.392293
C  5.60049 -1.421974 1.558493
C  6.384716 0.772647 1.155138
C  6.889373 -1.908709 1.569719
C  7.692131 0.335489 1.169309
C  7.932445 -1.014465 1.375509
H  -4.961016 -2.02099 2.287184
H  -5.032699 -3.574771 -0.398753
H  -5.443924 -4.206703 1.256149
H  -3.11005 -3.634806 2.038516
H  -2.721417 -2.996617 0.379139
H  -2.117774 -0.369947 -0.479965
H  -6.028513 -1.607549 -1.722225
H  -1.358394 -0.413654 -2.814902
H  -5.271224 -1.663111 -4.059878
H  -4.656893 3.220494 0.322516
H  -4.786781 2.443841 1.907715
H  -2.817022 1.172283 2.833271
H  -2.545078 3.188763 -0.926444
H  -0.416495 0.736194 2.768936
H  -0.156425 2.794307 -0.995169
H  1.554664 0.886145 1.768402
H  4.120478 1.161663 -0.479068
H  7.073702 -2.962718 1.726026
H  8.503041 1.036395 1.026595
H  8.950905 -1.376636 1.385747
elementType: Cl F O N C H
totalener: -2014.64998389 hartree
nucrepener: 3473.00303696 hartree
electener: -5487.65302084 hartree
oneelecener: -9665.73252552 hartree
twoeener: 4178.07950467 hartree
cpcmener: -0.04876906 hartree
kineticenergy: 2007.65428750 hartree
xcener: -167.133127143608 hartree
chargesum: 0.0000000
charge: -0.096553 -0.204002 -0.208034 -0.260730 -0.521772 -0.467990 -0.167031 -0.168035 -0.150435 -0.075952 -0.163930 -0.169074 0.219246 0.095003 -0.306045 -0.232677 -0.125909 -0.136004 0.087879 0.098815 -0.071303 -0.136694 -0.158334 0.199758 -0.211287 -0.236823 0.433906 -0.127402 0.412925 0.294782 0.317461 -0.240205 -0.244277 -0.064838 0.086422 0.099579 0.103717 0.102275 0.100590 0.176739 0.155367 0.141960 0.146024 0.110469 0.100622 0.140254 0.142889 0.142204 0.156073 0.204696 0.195697 0.154872 0.154980 0.170134
qa: -0.0966 -0.2040 -0.2080 -0.2607 -0.5218 -0.4680 -0.1670 -0.1680 -0.1504 -0.0760 -0.1639 -0.1691 0.2192 0.0950 -0.3060 -0.2327 -0.1259 -0.1360 0.0879 0.0988 -0.0713 -0.1367 -0.1583 0.1998 -0.2113 -0.2368 0.4339 -0.1274 0.4129 0.2948 0.3175 -0.2402 -0.2443 -0.0648 0.0864 0.0996 0.1037 0.1023 0.1006 0.1767 0.1554 0.1420 0.1460 0.1105 0.1006 0.1403 0.1429 0.1422 0.1561 0.2047 0.1957 0.1549 0.1550 0.1701
va: 1.2083 1.0938 1.0868 1.8922 1.9827 2.0420 2.8782 3.2486 3.2234 3.8619 3.9004 3.8879 3.7010 3.4220 4.0052 3.9912 3.9800 3.9647 3.8427 3.8513 3.5935 3.8929 3.9475 3.7759 3.9592 3.9423 4.2977 3.5439 4.0639 3.9541 3.9252 3.9543 3.9573 3.8081 1.0354 1.0148 1.0165 1.0170 1.0142 0.9736 1.0014 1.0096 1.0041 0.9949 1.0136 1.0163 1.0043 1.0087 1.0309 1.0357 1.0073 0.9998 1.0001 0.9835
dispcorr: -0.028791213 hartree
energy: -2014.678775102279
dipole: -26.23264 28.87541 2.64277 -6.16510 4.51870 -1.64640 11.81787 -10.91954 0.89833
magnitude: 3.24066 au
magnitude: 8.23711 debye
