program: Orca
programVersion: 5.0.2
elementType: Cl F F O O O N N N C C C C C C C C C C C C C C C C C C C C C C C C C H H H H H H H H H H H H H H H H H H H H
charge: 0
multiplicity: 1
keywords: wb97x-d3
keywords: def2-TZVPP
keywords: def2/J RIJCOSX
keywords: DEFGRID2
keywords: scfconv7
keywords: smallprint printgap noloewdin
keywords: NOSOSCF
formula: C25H20ClF2N3O3
InChI: InChI=1/C25H20ClF2N3O3/c26-18-10-8-17(9-11-18)23(16-6-7-16)31-34-14-15-4-12-19(13-5-15)29-25(33)30-24(32)22-20(27)2-1-3-21(22)28/h1-5,8-13,16,29-30H,6-7,14H2
54 atoms
Cl -2.436578 -4.214761 2.677565
F  5.351532 -1.244617 1.34833
F  5.691353 2.447781 -1.493304
O  -4.977527 1.203977 0.641678
O  1.423763 1.177343 -2.240423
O  3.584588 1.027017 1.280741
N  -5.134001 0.98637 -0.716348
N  1.237238 1.476238 0.016672
N  3.263569 0.907242 -0.972652
C  -5.043291 -0.550598 -2.478578
C  -4.099525 -1.476263 -3.200642
C  -5.4731 -1.940003 -2.87293
C  -4.82278 -0.200874 -1.064203
C  -4.244926 -1.204374 -0.136441
C  -5.058148 -2.092102 0.557583
C  -2.866634 -1.25383 0.047705
C  -4.507518 -3.023612 1.425173
C  -2.30365 -2.177931 0.91395
C  -3.132678 -3.055173 1.595053
C  -4.31434 2.443382 0.863289
C  -2.839748 2.291974 0.63651
C  -2.020381 1.796189 1.64684
C  -2.272085 2.527254 -0.609449
C  -0.128764 1.752535 0.152363
C  -0.684585 1.531344 1.41333
C  -0.931556 2.269769 -0.861758
C  1.899261 1.198353 -1.12024
C  5.469608 0.60542 -0.072246
C  4.022576 0.872296 0.15542
C  6.098765 -0.443673 0.585969
C  6.267296 1.416771 -0.867511
C  7.447041 -0.697296 0.458156
C  7.6231 1.213619 -1.012584
C  8.202804 0.145784 -0.344138
H  -5.458404 0.261306 -3.063149
H  -3.27245 -1.899221 -2.644902
H  -3.866476 -1.222984 -4.226189
H  -6.202671 -2.010902 -3.668513
H  -5.586865 -2.682881 -2.093931
H  -6.132088 -2.063321 0.425685
H  -2.220114 -0.568485 -0.486702
H  -5.147302 -3.711462 1.960779
H  -1.231547 -2.207993 1.052998
H  -4.74053 3.222063 0.223986
H  -4.525122 2.701296 1.901997
H  -2.431146 1.604148 2.630827
H  -2.88205 2.926467 -1.410568
H  -0.063739 1.142723 2.211961
H  -0.531931 2.490065 -1.838581
H  1.75886 1.367207 0.881034
H  3.720126 0.699568 -1.852307
H  7.896804 -1.53443 0.973986
H  8.211486 1.876642 -1.631937
H  9.263648 -0.033445 -0.450033
elementType: Cl F O N C H
totalener: -2014.65016173 hartree
nucrepener: 3481.09724581 hartree
electener: -5495.74740754 hartree
oneelecener: -9682.10858446 hartree
twoeener: 4186.36117692 hartree
cpcmener: -0.04957290 hartree
kineticenergy: 2007.66182804 hartree
xcener: -167.133603991747 hartree
chargesum: 0.0000000
charge: -0.096796 -0.203872 -0.208336 -0.258488 -0.523305 -0.467306 -0.167963 -0.181025 -0.152990 -0.080013 -0.166157 -0.165205 0.226782 0.115054 -0.239453 -0.343731 -0.130225 -0.113906 0.083314 0.104472 -0.070833 -0.146035 -0.130776 0.215033 -0.238890 -0.228329 0.436024 -0.128859 0.413518 0.302311 0.309056 -0.241875 -0.240230 -0.065276 0.086361 0.101221 0.102592 0.103454 0.099250 0.153482 0.178013 0.145755 0.146319 0.099571 0.110104 0.144900 0.139849 0.143849 0.148118 0.205204 0.197407 0.154421 0.154658 0.169785
qa: -0.0968 -0.2039 -0.2083 -0.2585 -0.5233 -0.4673 -0.1680 -0.1810 -0.1530 -0.0800 -0.1662 -0.1652 0.2268 0.1151 -0.2395 -0.3437 -0.1302 -0.1139 0.0833 0.1045 -0.0708 -0.1460 -0.1308 0.2150 -0.2389 -0.2283 0.4360 -0.1289 0.4135 0.3023 0.3091 -0.2419 -0.2402 -0.0653 0.0864 0.1012 0.1026 0.1035 0.0993 0.1535 0.1780 0.1458 0.1463 0.0996 0.1101 0.1449 0.1398 0.1438 0.1481 0.2052 0.1974 0.1544 0.1547 0.1698
va: 1.2083 1.0942 1.0865 1.8902 1.9807 2.0409 2.8809 3.2387 3.2152 3.8681 3.8875 3.8983 3.6905 3.3871 3.9985 4.0086 3.9587 3.9639 3.8513 3.8480 3.6064 3.9154 3.9043 3.6984 3.9602 4.0002 4.3044 3.5428 4.0693 3.9505 3.9282 3.9549 3.9565 3.8081 1.0354 1.0144 1.0170 1.0169 1.0148 1.0034 0.9804 1.0039 1.0043 1.0145 0.9954 1.0018 1.0157 1.0080 1.0278 1.0358 1.0059 1.0001 0.9999 0.9836
dispcorr: -0.029105891 hartree
energy: -2014.679267620741
dipole: -28.91646 31.60105 2.68459 4.98012 -5.49361 -0.51350 -13.95999 13.22307 -0.73691
magnitude: 2.83086 au
magnitude: 7.19547 debye
