program: Orca
programVersion: 5.0.2
elementType: Cl F F O O O N N N C C C C C C C C C C C C C C C C C C C C C C C C C H H H H H H H H H H H H H H H H H H H H
charge: 0
multiplicity: 1
keywords: wb97x-d3
keywords: def2-TZVPP
keywords: def2/J RIJCOSX
keywords: DEFGRID2
keywords: scfconv7
keywords: smallprint printgap noloewdin
keywords: NOSOSCF
formula: C25H20ClF2N3O3
InChI: InChI=1/C25H20ClF2N3O3/c26-18-10-8-17(9-11-18)23(16-6-7-16)31-34-14-15-4-12-19(13-5-15)29-25(33)30-24(32)22-20(27)2-1-3-21(22)28/h1-5,8-13,16,29-30H,6-7,14H2
54 atoms
Cl -3.138803 -1.146407 -5.302619
F  4.846888 -2.251074 1.775854
F  6.170486 2.167723 1.030473
O  -4.877625 1.27541 0.261214
O  2.152187 2.039166 -1.106427
O  3.308994 0.105651 2.359052
N  -4.895107 0.174456 1.097029
N  1.359565 1.292533 0.903847
N  3.579749 0.983078 0.274286
C  -4.692092 -2.147316 1.292548
C  -5.103254 -3.468439 0.699012
C  -3.679865 -3.239681 1.062837
C  -4.645202 -0.915709 0.483969
C  -4.28201 -0.984001 -0.952657
C  -2.972905 -0.721483 -1.345168
C  -5.232719 -1.298135 -1.91628
C  -2.614566 -0.770892 -2.682697
C  -4.887048 -1.351531 -3.25868
C  -3.578865 -1.085216 -3.628052
C  -4.242006 2.36622 0.919732
C  -2.753828 2.179755 0.940689
C  -2.126077 1.502638 1.982022
C  -1.973486 2.581117 -0.136167
C  0.003007 1.63019 0.84682
C  -0.771576 1.229908 1.938273
C  -0.611254 2.323374 -0.195833
C  2.304675 1.485413 -0.033451
C  5.454604 -0.028947 1.387399
C  4.016945 0.361505 1.402242
C  5.818259 -1.350469 1.616217
C  6.487086 0.883653 1.220238
C  7.132069 -1.763324 1.658471
C  7.816299 0.5204 1.262333
C  8.127239 -0.812985 1.480857
H  -4.983481 -1.975278 2.321478
H  -5.36174 -3.506255 -0.351143
H  -5.702581 -4.111994 1.329064
H  -3.28208 -3.72483 1.944118
H  -2.963883 -3.10898 0.261252
H  -2.220795 -0.477778 -0.604789
H  -6.255418 -1.501582 -1.62574
H  -1.595243 -0.564736 -2.979208
H  -5.633829 -1.595627 -4.001693
H  -4.516218 3.248655 0.340296
H  -4.642995 2.483278 1.930762
H  -2.699089 1.177832 2.841536
H  -2.433398 3.111507 -0.961671
H  -0.308116 0.695679 2.759536
H  -0.055116 2.665002 -1.052445
H  1.657685 0.802858 1.742294
H  4.243566 1.114042 -0.479456
H  7.372206 -2.80435 1.825576
H  8.589256 1.265374 1.132653
H  9.163844 -1.117777 1.513521
elementType: Cl F O N C H
totalener: -2014.65061588 hartree
nucrepener: 3446.07916330 hartree
electener: -5460.72977918 hartree
oneelecener: -9611.95326288 hartree
twoeener: 4151.22348370 hartree
cpcmener: -0.04877481 hartree
kineticenergy: 2007.65167117 hartree
xcener: -167.132232162834 hartree
chargesum: -0.0000000
charge: -0.096697 -0.204147 -0.208093 -0.258839 -0.521211 -0.467737 -0.166314 -0.167863 -0.150986 -0.072737 -0.164239 -0.170492 0.224927 0.090344 -0.299799 -0.234814 -0.120932 -0.135887 0.085426 0.099764 -0.070616 -0.138022 -0.168101 0.198721 -0.210420 -0.228356 0.432771 -0.127259 0.412014 0.297785 0.315722 -0.242051 -0.244103 -0.064537 0.085830 0.099185 0.103395 0.101954 0.100630 0.164686 0.156657 0.143339 0.145935 0.110569 0.100522 0.140457 0.143167 0.142974 0.156685 0.204580 0.196174 0.154851 0.154849 0.170339
qa: -0.0967 -0.2041 -0.2081 -0.2588 -0.5212 -0.4677 -0.1663 -0.1679 -0.1510 -0.0727 -0.1642 -0.1705 0.2249 0.0903 -0.2998 -0.2348 -0.1209 -0.1359 0.0854 0.0998 -0.0706 -0.1380 -0.1681 0.1987 -0.2104 -0.2284 0.4328 -0.1273 0.4120 0.2978 0.3157 -0.2421 -0.2441 -0.0645 0.0858 0.0992 0.1034 0.1020 0.1006 0.1647 0.1567 0.1433 0.1459 0.1106 0.1005 0.1405 0.1432 0.1430 0.1567 0.2046 0.1962 0.1549 0.1548 0.1703
va: 1.2081 1.0938 1.0866 1.8961 1.9840 2.0420 2.8817 3.2519 3.2213 3.8610 3.8998 3.8878 3.6994 3.4267 4.0060 3.9987 3.9701 3.9669 3.8430 3.8489 3.5931 3.8944 3.9532 3.7875 3.9613 3.9448 4.2997 3.5466 4.0638 3.9531 3.9247 3.9549 3.9569 3.8071 1.0350 1.0151 1.0166 1.0172 1.0139 0.9850 1.0007 1.0074 1.0041 0.9947 1.0134 1.0161 1.0047 1.0081 1.0304 1.0354 1.0069 0.9998 1.0001 0.9834
dispcorr: -0.028273861 hartree
energy: -2014.678889741844
dipole: -26.34199 28.95863 2.61664 -5.89400 4.38265 -1.51135 11.88705 -10.94758 0.93948
magnitude: 3.16443 au
magnitude: 8.04333 debye
