program: Orca
programVersion: 5.0.2
elementType: Cl F F O O O N N N C C C C C C C C C C C C C C C C C C C C C C C C C H H H H H H H H H H H H H H H H H H H H
charge: 0
multiplicity: 1
keywords: wb97x-d3
keywords: def2-TZVPP
keywords: def2/J RIJCOSX
keywords: DEFGRID2
keywords: scfconv7
keywords: smallprint printgap noloewdin
keywords: NOSOSCF
formula: C25H20ClF2N3O3
InChI: InChI=1/C25H20ClF2N3O3/c26-18-10-8-17(9-11-18)23(16-6-7-16)31-34-14-15-4-12-19(13-5-15)29-25(33)30-24(32)22-20(27)2-1-3-21(22)28/h1-5,8-13,16,29-30H,6-7,14H2
54 atoms
Cl -2.291582 -1.664155 -5.037126
F  6.209258 2.350806 0.648081
F  4.791673 -2.065738 1.205979
O  -4.877943 1.538271 -0.258822
O  1.37965 0.198663 3.112408
O  3.658857 1.220324 -0.190244
N  -5.131102 0.558632 0.685679
N  1.247538 1.225579 1.074073
N  3.252485 0.354847 1.878591
C  -5.155763 -1.727434 1.186355
C  -5.575707 -3.078112 0.668857
C  -4.22847 -2.912054 1.2748
C  -4.855983 -0.614767 0.267592
C  -4.233673 -0.890246 -1.050915
C  -2.850671 -0.81487 -1.185242
C  -5.009857 -1.209349 -2.158733
C  -2.246565 -1.053371 -2.409447
C  -4.417575 -1.450911 -3.389729
C  -3.039228 -1.368048 -3.502396
C  -4.231612 2.645542 0.359959
C  -2.783908 2.343488 0.611053
C  -1.837222 2.52581 -0.393431
C  -2.361438 1.774382 1.805136
C  -0.10728 1.567731 0.992467
C  -0.520569 2.149977 -0.208731
C  -1.043911 1.386729 2.009097
C  1.881335 0.585905 2.073171
C  5.448428 0.160388 0.928262
C  4.038384 0.628573 0.803388
C  6.500866 1.057872 0.801694
C  5.782845 -1.175759 1.101285
C  7.821146 0.667302 0.855416
C  7.088077 -1.616982 1.147612
C  8.103175 -0.680437 1.025593
H  -5.61306 -1.408545 2.114994
H  -5.638319 -3.222748 -0.401922
H  -6.339913 -3.593796 1.234859
H  -4.048952 -3.312137 2.263745
H  -3.367847 -2.93762 0.618504
H  -2.233209 -0.569569 -0.329854
H  -6.087019 -1.268971 -2.069905
H  -1.171248 -0.990489 -2.504866
H  -5.029171 -1.697565 -4.246752
H  -4.341144 3.471071 -0.344403
H  -4.747961 2.91617 1.285622
H  -2.129656 2.967986 -1.338346
H  -3.071815 1.623959 2.608775
H  0.197286 2.306284 -1.005219
H  -0.771646 0.953279 2.956583
H  1.814787 1.47385 0.269295
H  3.687247 -0.100478 2.671982
H  8.611033 1.400464 0.766444
H  7.304493 -2.668997 1.272958
H  9.133167 -1.006283 1.063385
elementType: Cl F O N C H
totalener: -2014.65046250 hartree
nucrepener: 3461.41562351 hartree
electener: -5476.06608601 hartree
oneelecener: -9642.57901739 hartree
twoeener: 4166.51293139 hartree
cpcmener: -0.04900284 hartree
kineticenergy: 2007.64348135 hartree
xcener: -167.130460490729 hartree
chargesum: -0.0000000
charge: -0.096714 -0.204323 -0.208232 -0.259236 -0.521036 -0.469068 -0.167024 -0.165171 -0.150684 -0.075772 -0.164731 -0.169310 0.226635 0.096421 -0.321500 -0.233995 -0.119201 -0.134129 0.084787 0.101642 -0.072962 -0.154534 -0.138247 0.202275 -0.227732 -0.225664 0.433298 -0.125014 0.411054 0.301713 0.310839 -0.243539 -0.243049 -0.065671 0.086816 0.099022 0.103796 0.103003 0.100984 0.174613 0.154809 0.145282 0.146308 0.110939 0.099517 0.144787 0.138483 0.142967 0.156280 0.203459 0.196781 0.154397 0.155347 0.170285
qa: -0.0967 -0.2043 -0.2082 -0.2592 -0.5210 -0.4691 -0.1670 -0.1652 -0.1507 -0.0758 -0.1647 -0.1693 0.2266 0.0964 -0.3215 -0.2340 -0.1192 -0.1341 0.0848 0.1016 -0.0730 -0.1545 -0.1382 0.2023 -0.2277 -0.2257 0.4333 -0.1250 0.4111 0.3017 0.3108 -0.2435 -0.2430 -0.0657 0.0868 0.0990 0.1038 0.1030 0.1010 0.1746 0.1548 0.1453 0.1463 0.1109 0.0995 0.1448 0.1385 0.1430 0.1563 0.2035 0.1968 0.1544 0.1553 0.1703
va: 1.2080 1.0938 1.0863 1.8932 1.9846 2.0407 2.8812 3.2529 3.2191 3.8625 3.8991 3.8880 3.6957 3.4158 4.0088 3.9967 3.9716 3.9627 3.8470 3.8492 3.5974 3.9223 3.9103 3.7747 3.9287 3.9769 4.2992 3.5467 4.0653 3.9521 3.9270 3.9552 3.9577 3.8083 1.0348 1.0150 1.0166 1.0169 1.0142 0.9786 1.0023 1.0056 1.0038 0.9947 1.0139 1.0021 1.0176 1.0076 1.0317 1.0352 1.0061 1.0002 0.9997 0.9834
dispcorr: -0.028632016 hartree
energy: -2014.679094515558
dipole: -29.59481 32.16539 2.57058 -3.44351 2.31928 -1.12423 11.54474 -11.09684 0.44789
magnitude: 2.84120 au
magnitude: 7.22175 debye
