program: Orca
programVersion: 5.0.2
elementType: Cl F F O O O N N N C C C C C C C C C C C C C C C C C C C C C C C C C H H H H H H H H H H H H H H H H H H H H
charge: 0
multiplicity: 1
keywords: wb97x-d3
keywords: def2-TZVPP
keywords: def2/J RIJCOSX
keywords: DEFGRID2
keywords: scfconv7
keywords: smallprint printgap noloewdin
keywords: NOSOSCF
formula: C25H20ClF2N3O3
InChI: InChI=1/C25H20ClF2N3O3/c26-18-10-8-17(9-11-18)23(16-6-7-16)31-34-14-15-4-12-19(13-5-15)29-25(33)30-24(32)22-20(27)2-1-3-21(22)28/h1-5,8-13,16,29-30H,6-7,14H2
54 atoms
Cl -3.105255 -1.521805 -5.509733
F  5.47143 -0.694294 -0.989837
F  5.858989 1.14983 3.2797
O  -4.692406 1.457426 -0.166542
O  1.401863 -0.194591 2.981845
O  3.894631 1.516613 0.161294
N  -4.875396 0.422663 0.727813
N  1.424106 1.298781 1.25395
N  3.35776 0.197665 1.940435
C  -5.001952 -1.891165 1.054744
C  -5.61821 -3.158889 0.52447
C  -4.178897 -3.143184 0.896886
C  -4.762215 -0.72561 0.18447
C  -4.368909 -0.924679 -1.231864
C  -3.024033 -0.85625 -1.583768
C  -5.318729 -1.172177 -2.215366
C  -2.628555 -1.039111 -2.89891
C  -4.936413 -1.356594 -3.536361
C  -3.592487 -1.288318 -3.863786
C  -4.084051 2.560846 0.493317
C  -2.62935 2.297072 0.746109
C  -2.179313 1.847387 1.979852
C  -1.703127 2.411517 -0.286967
C  0.060933 1.605498 1.145526
C  -0.85005 1.509314 2.193689
C  -0.377246 2.073391 -0.09369
C  1.981356 0.417941 2.104454
C  5.621178 0.242095 1.142525
C  4.21554 0.725438 1.028131
C  6.219193 -0.425744 0.083016
C  6.410998 0.49541 2.253705
C  7.534001 -0.836244 0.112418
C  7.733463 0.112665 2.327539
C  8.285169 -0.555967 1.245041
H  -5.270566 -1.62108 2.068697
H  -5.871964 -3.211593 -0.526122
H  -6.318387 -3.661901 1.178019
H  -3.869897 -3.638768 1.807483
H  -3.447245 -3.173718 0.099338
H  -2.2737 -0.662043 -0.827608
H  -6.368828 -1.221586 -1.957819
H  -1.581377 -0.986462 -3.16355
H  -5.682058 -1.549677 -4.295317
H  -4.21626 3.403382 -0.186607
H  -4.612282 2.788165 1.423669
H  -2.875944 1.760341 2.804243
H  -2.020235 2.763684 -1.260798
H  -0.544257 1.187124 3.175433
H  0.326751 2.164365 -0.911751
H  2.024671 1.663967 0.521258
H  3.728719 -0.48328 2.59148
H  7.961001 -1.363294 -0.729722
H  8.319024 0.336288 3.208682
H  9.319897 -0.866292 1.284518
elementType: Cl F O N C H
totalener: -2014.65102934 hartree
nucrepener: 3414.09283612 hartree
electener: -5428.74386546 hartree
oneelecener: -9548.14490678 hartree
twoeener: 4119.40104133 hartree
cpcmener: -0.04989875 hartree
kineticenergy: 2007.67224891 hartree
xcener: -167.134053017634 hartree
chargesum: -0.0000000
charge: -0.096813 -0.204962 -0.208136 -0.255569 -0.521002 -0.465564 -0.163695 -0.186495 -0.151622 -0.075698 -0.164184 -0.169699 0.233509 0.080333 -0.294658 -0.231810 -0.116845 -0.140418 0.085334 0.107518 -0.061335 -0.131487 -0.192018 0.203811 -0.223084 -0.200844 0.435000 -0.131275 0.409162 0.302025 0.318772 -0.245468 -0.247041 -0.065927 0.086030 0.098086 0.103204 0.101817 0.099430 0.155549 0.158029 0.144951 0.146176 0.113054 0.097782 0.140947 0.144979 0.150135 0.144935 0.205172 0.199700 0.154798 0.155364 0.170048
qa: -0.0968 -0.2050 -0.2081 -0.2556 -0.5210 -0.4656 -0.1637 -0.1865 -0.1516 -0.0757 -0.1642 -0.1697 0.2335 0.0803 -0.2947 -0.2318 -0.1168 -0.1404 0.0853 0.1075 -0.0613 -0.1315 -0.1920 0.2038 -0.2231 -0.2008 0.4350 -0.1313 0.4092 0.3020 0.3188 -0.2455 -0.2470 -0.0659 0.0860 0.0981 0.1032 0.1018 0.0994 0.1555 0.1580 0.1450 0.1462 0.1131 0.0978 0.1409 0.1450 0.1501 0.1449 0.2052 0.1997 0.1548 0.1554 0.1700
va: 1.2080 1.0931 1.0865 1.9052 1.9838 2.0434 2.8951 3.2375 3.2124 3.8650 3.8968 3.8884 3.7032 3.4416 4.0082 4.0068 3.9572 3.9731 3.8424 3.8439 3.6111 3.9170 3.9456 3.7274 4.0110 3.9693 4.3045 3.5474 4.0728 3.9524 3.9276 3.9569 3.9597 3.8055 1.0338 1.0154 1.0166 1.0172 1.0137 0.9972 1.0001 1.0047 1.0043 0.9943 1.0134 1.0125 1.0049 1.0252 1.0071 1.0355 1.0036 0.9998 0.9997 0.9835
dispcorr: -0.027448779 hartree
energy: -2014.678478116858
dipole: -28.27470 30.74714 2.47244 -4.52301 3.46154 -1.06147 11.16306 -10.78526 0.37780
magnitude: 2.71706 au
magnitude: 6.90622 debye
