program: Orca
programVersion: 5.0.2
elementType: Cl F F O O O N N N C C C C C C C C C C C C C C C C C C C C C C C C C H H H H H H H H H H H H H H H H H H H H
charge: 0
multiplicity: 1
keywords: wb97x-d3
keywords: def2-TZVPP
keywords: def2/J RIJCOSX
keywords: DEFGRID2
keywords: scfconv7
keywords: smallprint printgap noloewdin
keywords: NOSOSCF
formula: C25H20ClF2N3O3
InChI: InChI=1/C25H20ClF2N3O3/c26-18-10-8-17(9-11-18)23(16-6-7-16)31-34-14-15-4-12-19(13-5-15)29-25(33)30-24(32)22-20(27)2-1-3-21(22)28/h1-5,8-13,16,29-30H,6-7,14H2
54 atoms
Cl -3.112768 -1.441136 -5.483255
F  5.843208 -0.077882 -1.153065
F  5.661288 0.608578 3.467041
O  -4.705572 1.519908 -0.109229
O  1.410122 -0.667416 2.630627
O  3.946552 1.570395 0.254287
N  -4.962848 0.47132 0.749577
N  1.446661 1.090386 1.172859
N  3.389025 -0.056378 1.749094
C  -5.200722 -1.841734 1.010877
C  -5.828846 -3.078997 0.426383
C  -4.407494 -3.113963 0.861118
C  -4.884287 -0.666444 0.1789
C  -4.459956 -0.848842 -1.230467
C  -3.105385 -0.816973 -1.549152
C  -5.393231 -1.051368 -2.240022
C  -2.684333 -0.998675 -2.856644
C  -4.985283 -1.232272 -3.553661
C  -3.632025 -1.206836 -3.847271
C  -4.03358 2.56062 0.590151
C  -2.587736 2.219862 0.800702
C  -2.163453 1.540581 1.936803
C  -1.64432 2.503832 -0.182496
C  0.086715 1.419818 1.100604
C  -0.844128 1.14193 2.099475
C  -0.325637 2.114857 -0.037164
C  2.001022 0.096607 1.889852
C  5.694698 0.266417 1.154561
C  4.26807 0.669158 1.006601
C  6.450027 -0.061923 0.035106
C  6.354186 0.267779 2.376364
C  7.784728 -0.395769 0.111606
C  7.691598 -0.042859 2.500944
C  8.397948 -0.378818 1.356039
H  -5.504442 -1.585166 2.018383
H  -6.036941 -3.102746 -0.635154
H  -6.571317 -3.574606 1.037543
H  -4.152988 -3.636948 1.773289
H  -3.642502 -3.148584 0.095676
H  -2.368087 -0.654728 -0.772463
H  -6.450362 -1.069403 -2.008252
H  -1.629981 -0.976907 -3.095925
H  -5.718283 -1.391798 -4.332588
H  -4.135291 3.442433 -0.043517
H  -4.53628 2.763804 1.539965
H  -2.871687 1.319528 2.72578
H  -1.940118 3.039041 -1.076953
H  -0.55984 0.637195 3.008951
H  0.393456 2.349129 -0.813097
H  2.061564 1.586515 0.535354
H  3.75701 -0.82739 2.292521
H  8.332178 -0.663099 -0.781851
H  8.169916 -0.019078 3.470451
H  9.446103 -0.631598 1.433959
elementType: Cl F O N C H
totalener: -2014.65083927 hartree
nucrepener: 3411.81269617 hartree
electener: -5426.46353544 hartree
oneelecener: -9543.64803690 hartree
twoeener: 4117.18450146 hartree
cpcmener: -0.04977103 hartree
kineticenergy: 2007.65142838 hartree
xcener: -167.130875887106 hartree
chargesum: -0.0000000
charge: -0.096806 -0.203675 -0.208160 -0.255153 -0.522341 -0.467391 -0.164998 -0.183065 -0.153732 -0.073380 -0.163936 -0.170228 0.229592 0.079190 -0.288568 -0.234851 -0.118702 -0.138966 0.085189 0.105487 -0.069288 -0.134678 -0.175676 0.198156 -0.217905 -0.203477 0.434662 -0.128141 0.412764 0.300435 0.311064 -0.242563 -0.241053 -0.065560 0.086116 0.099036 0.103424 0.101782 0.099437 0.154291 0.158531 0.144983 0.146253 0.110611 0.099419 0.139034 0.145427 0.150541 0.144515 0.204876 0.197380 0.154884 0.155010 0.170204
qa: -0.0968 -0.2037 -0.2082 -0.2552 -0.5223 -0.4674 -0.1650 -0.1831 -0.1537 -0.0734 -0.1639 -0.1702 0.2296 0.0792 -0.2886 -0.2349 -0.1187 -0.1390 0.0852 0.1055 -0.0693 -0.1347 -0.1757 0.1982 -0.2179 -0.2035 0.4347 -0.1281 0.4128 0.3004 0.3111 -0.2426 -0.2411 -0.0656 0.0861 0.0990 0.1034 0.1018 0.0994 0.1543 0.1585 0.1450 0.1463 0.1106 0.0994 0.1390 0.1454 0.1505 0.1445 0.2049 0.1974 0.1549 0.1550 0.1702
va: 1.2080 1.0944 1.0867 1.9042 1.9824 2.0405 2.8879 3.2388 3.2135 3.8606 3.8968 3.8893 3.7040 3.4418 4.0053 4.0053 3.9634 3.9719 3.8416 3.8386 3.6019 3.9121 3.9473 3.7352 4.0068 3.9709 4.3063 3.5454 4.0695 3.9529 3.9288 3.9543 3.9565 3.8088 1.0340 1.0152 1.0166 1.0174 1.0137 0.9976 0.9999 1.0049 1.0042 0.9948 1.0144 1.0182 1.0024 1.0255 1.0067 1.0355 1.0060 1.0000 0.9998 0.9835
dispcorr: -0.027485769 hartree
energy: -2014.678325044016
dipole: -29.05224 31.58982 2.53758 -4.32389 3.40721 -0.91668 11.28301 -10.80527 0.47775
magnitude: 2.74005 au
magnitude: 6.96465 debye
