program: Orca
programVersion: 5.0.2
elementType: Cl F F O O O N N N C C C C C C C C C C C C C C C C C C C C C C C C C H H H H H H H H H H H H H H H H H H H H
charge: 0
multiplicity: 1
keywords: wb97x-d3
keywords: def2-TZVPP
keywords: def2/J RIJCOSX
keywords: DEFGRID2
keywords: scfconv7
keywords: smallprint printgap noloewdin
keywords: NOSOSCF
formula: C25H20ClF2N3O3
InChI: InChI=1/C25H20ClF2N3O3/c26-18-10-8-17(9-11-18)23(16-6-7-16)31-34-14-15-4-12-19(13-5-15)29-25(33)30-24(32)22-20(27)2-1-3-21(22)28/h1-5,8-13,16,29-30H,6-7,14H2
54 atoms
Cl -3.007411 0.110617 -5.690131
F  5.982382 1.65457 0.288568
F  5.049007 -2.08748 2.917288
O  -5.017415 1.26981 0.280189
O  1.724236 0.237304 -1.085557
O  3.4521 0.390463 2.671757
N  -5.038012 -0.014835 0.799651
N  1.275783 0.77951 1.088143
N  3.394361 0.081649 0.414553
C  -4.63769 -2.313161 0.418125
C  -3.480006 -2.695874 1.312142
C  -4.870359 -2.68518 1.847877
C  -4.715301 -0.911365 -0.047638
C  -4.3324 -0.660869 -1.455509
C  -3.09673 -1.120634 -1.904078
C  -5.162723 0.019981 -2.341474
C  -2.679392 -0.884215 -3.204161
C  -4.765318 0.247072 -3.649288
C  -3.519961 -0.197301 -4.065147
C  -4.277738 2.111966 1.148981
C  -2.811219 1.783245 1.121863
C  -2.129552 1.41531 2.274986
C  -2.104699 1.804249 -0.076456
C  -0.087298 1.101889 1.027349
C  -0.78576 1.083453 2.233677
C  -0.760395 1.47321 -0.137188
C  2.062152 0.37117 0.076033
C  5.465667 -0.211342 1.595988
C  4.01158 0.125006 1.624484
C  6.408568 0.57632 0.952647
C  5.940271 -1.309193 2.300045
C  7.759399 0.301655 0.994037
C  7.278531 -1.630238 2.364512
C  8.183232 -0.810171 1.705867
H  -4.914809 -3.044592 -0.331421
H  -2.813514 -1.898525 1.617803
H  -2.997751 -3.646179 1.12616
H  -5.353426 -3.636988 2.025403
H  -5.146965 -1.904078 2.541854
H  -2.437766 -1.653947 -1.231215
H  -6.137507 0.36558 -2.025038
H  -1.710063 -1.231177 -3.534631
H  -5.420295 0.77159 -4.331412
H  -4.460904 3.122661 0.779694
H  -4.665691 2.052792 2.171035
H  -2.652401 1.381971 3.223139
H  -2.605747 2.089814 -0.993925
H  -0.275809 0.799164 3.146628
H  -0.253926 1.522804 -1.087428
H  1.687695 0.764136 2.015585
H  3.95088 -0.206595 -0.38108
H  8.46313 0.945666 0.48507
H  7.605601 -2.500422 2.916933
H  9.238127 -1.042169 1.749082
elementType: Cl F O N C H
totalener: -2014.64832873 hartree
nucrepener: 3460.45103453 hartree
electener: -5475.09936326 hartree
oneelecener: -9641.07546611 hartree
twoeener: 4165.97610285 hartree
cpcmener: -0.04764753 hartree
kineticenergy: 2007.64746927 hartree
xcener: -167.130440731264 hartree
chargesum: 0.0000000
charge: -0.095045 -0.208306 -0.205130 -0.267077 -0.522076 -0.465788 -0.171328 -0.177648 -0.152567 -0.072609 -0.166112 -0.160288 0.222656 0.030170 -0.234710 -0.191831 -0.160633 -0.157302 0.119205 0.107685 -0.018523 -0.176598 -0.200359 0.197620 -0.198179 -0.210393 0.433369 -0.130300 0.407025 0.313882 0.308185 -0.245460 -0.248567 -0.066022 0.112975 0.094117 0.100383 0.102582 0.082744 0.159917 0.145894 0.144512 0.144465 0.113676 0.096660 0.144405 0.140919 0.144726 0.150407 0.203022 0.200927 0.155224 0.155372 0.170129
qa: -0.0950 -0.2083 -0.2051 -0.2671 -0.5221 -0.4658 -0.1713 -0.1776 -0.1526 -0.0726 -0.1661 -0.1603 0.2227 0.0302 -0.2347 -0.1918 -0.1606 -0.1573 0.1192 0.1077 -0.0185 -0.1766 -0.2004 0.1976 -0.1982 -0.2104 0.4334 -0.1303 0.4070 0.3139 0.3082 -0.2455 -0.2486 -0.0660 0.1130 0.0941 0.1004 0.1026 0.0827 0.1599 0.1459 0.1445 0.1445 0.1137 0.0967 0.1444 0.1409 0.1447 0.1504 0.2030 0.2009 0.1552 0.1554 0.1701
va: 1.2102 1.0859 1.0927 1.8849 1.9809 2.0427 2.8743 3.2453 3.2114 3.7578 3.9123 3.9287 3.7521 3.5062 3.9685 3.9825 4.0072 3.9942 3.8167 3.8419 3.5843 3.9405 3.9873 3.7602 3.9546 3.9612 4.3016 3.5466 4.0747 3.9315 3.9479 3.9571 3.9598 3.8057 1.0059 1.0129 1.0174 1.0156 1.0391 0.9933 1.0136 1.0075 1.0062 0.9956 1.0128 1.0018 1.0065 1.0068 1.0283 1.0357 1.0027 0.9997 0.9998 0.9834
dispcorr: -0.028829119 hartree
energy: -2014.677157850844
dipole: -25.59633 28.35277 2.75645 -6.06217 4.97654 -1.08563 13.82603 -12.95051 0.87552
magnitude: 3.08920 au
magnitude: 7.85211 debye
