program: Orca
programVersion: 5.0.2
elementType: Cl F F O O O N N N C C C C C C C C C C C C C C C C C C C C C C C C C H H H H H H H H H H H H H H H H H H H H
charge: 0
multiplicity: 1
keywords: wb97x-d3
keywords: def2-TZVPP
keywords: def2/J RIJCOSX
keywords: DEFGRID2
keywords: scfconv7
keywords: smallprint printgap noloewdin
keywords: NOSOSCF
formula: C25H20ClF2N3O3
InChI: InChI=1/C25H20ClF2N3O3/c26-18-10-8-17(9-11-18)23(16-6-7-16)31-34-14-15-4-12-19(13-5-15)29-25(33)30-24(32)22-20(27)2-1-3-21(22)28/h1-5,8-13,16,29-30H,6-7,14H2
54 atoms
Cl -2.453023 -4.275131 3.163057
F  5.710394 0.932981 1.92206
F  4.990698 -0.18373 -2.553697
O  -5.109368 0.985396 0.582766
O  1.769746 3.070855 -1.622486
O  3.210393 -0.042372 0.690798
N  -5.07411 0.63878 -0.758642
N  1.124106 1.504256 -0.088355
N  3.32623 1.65187 -0.828812
C  -4.46452 -0.961827 -2.384956
C  -4.810401 -0.057159 -3.524722
C  -3.376297 -0.332078 -3.225291
C  -4.600141 -0.525027 -0.977062
C  -4.103494 -1.460732 0.057055
C  -4.883025 -1.85008 1.143229
C  -2.812134 -1.969319 -0.063676
C  -4.383672 -2.724094 2.095332
C  -2.293805 -2.829405 0.891282
C  -3.087486 -3.197724 1.965552
C  -4.470952 2.242183 0.754874
C  -2.988966 2.12569 0.541575
C  -2.352754 2.766536 -0.510801
C  -2.225151 1.294211 1.358307
C  -0.240904 1.774608 0.067902
C  -0.993791 2.607973 -0.755622
C  -0.875449 1.120658 1.128577
C  2.007848 2.13503 -0.88168
C  5.302907 0.38982 -0.310677
C  3.846443 0.630596 -0.098873
C  6.190475 0.512779 0.749481
C  5.826917 -0.035201 -1.522558
C  7.536073 0.243113 0.626808
C  7.163402 -0.329007 -1.692234
C  8.011666 -0.182458 -0.605243
H  -4.61755 -2.024255 -2.535262
H  -5.202348 0.924035 -3.294636
H  -5.247475 -0.52355 -4.397784
H  -2.818784 -0.981729 -3.887269
H  -2.793318 0.456197 -2.763962
H  -5.898099 -1.492112 1.247665
H  -2.18929 -1.682413 -0.901139
H  -5.001035 -3.02575 2.930377
H  -1.283805 -3.203392 0.794396
H  -4.902192 2.990929 0.082544
H  -4.703302 2.535716 1.779969
H  -2.925958 3.406117 -1.171331
H  -2.687688 0.768063 2.185023
H  -0.554056 3.122905 -1.593396
H  -0.302014 0.468171 1.77661
H  1.497616 0.768682 0.503699
H  3.95985 2.167641 -1.427343
H  8.196887 0.362966 1.474216
H  7.529732 -0.668541 -2.651289
H  9.06349 -0.40411 -0.719598
elementType: Cl F O N C H
totalener: -2014.64807313 hartree
nucrepener: 3485.70673973 hartree
electener: -5500.35481286 hartree
oneelecener: -9691.13068766 hartree
twoeener: 4190.77587480 hartree
cpcmener: -0.04738917 hartree
kineticenergy: 2007.64600926 hartree
xcener: -167.130941925619 hartree
chargesum: -0.0000000
charge: -0.094616 -0.204885 -0.208045 -0.269344 -0.520149 -0.465937 -0.165584 -0.172167 -0.151620 -0.065665 -0.160306 -0.173130 0.212030 0.039481 -0.190640 -0.238969 -0.162381 -0.165242 0.123158 0.100605 -0.011259 -0.191518 -0.193842 0.205041 -0.205396 -0.211363 0.431687 -0.129349 0.407712 0.302906 0.316986 -0.246811 -0.245791 -0.065219 0.112704 0.083151 0.101610 0.100949 0.097569 0.145837 0.161087 0.146118 0.145903 0.097228 0.114143 0.143738 0.141464 0.153975 0.140686 0.204245 0.199365 0.155245 0.154789 0.169815
qa: -0.0946 -0.2049 -0.2080 -0.2693 -0.5201 -0.4659 -0.1656 -0.1722 -0.1516 -0.0657 -0.1603 -0.1731 0.2120 0.0395 -0.1906 -0.2390 -0.1624 -0.1652 0.1232 0.1006 -0.0113 -0.1915 -0.1938 0.2050 -0.2054 -0.2114 0.4317 -0.1293 0.4077 0.3029 0.3170 -0.2468 -0.2458 -0.0652 0.1127 0.0832 0.1016 0.1009 0.0976 0.1458 0.1611 0.1461 0.1459 0.0972 0.1141 0.1437 0.1415 0.1540 0.1407 0.2042 0.1994 0.1552 0.1548 0.1698
va: 1.2106 1.0933 1.0863 1.8793 1.9855 2.0447 2.8674 3.2524 3.2156 3.7524 3.9290 3.9117 3.7632 3.4981 3.9789 3.9706 3.9947 4.0061 3.8147 3.8583 3.5624 3.9430 3.9607 3.7673 3.9398 3.9339 4.3032 3.5495 4.0705 3.9533 3.9304 3.9584 3.9594 3.8051 1.0057 1.0396 1.0157 1.0173 1.0116 1.0146 0.9904 1.0056 1.0067 1.0123 0.9961 1.0044 1.0051 1.0287 1.0094 1.0356 1.0039 0.9997 1.0000 0.9835
dispcorr: -0.029188056 hartree
energy: -2014.677261186210
dipole: -26.19941 28.99538 2.79597 8.82122 -9.56525 -0.74403 -15.34589 14.56595 -0.77993
magnitude: 2.99655 au
magnitude: 7.61663 debye
