program: Orca
programVersion: 5.0.2
elementType: Cl F F O O O N N N C C C C C C C C C C C C C C C C C C C C C C C C C H H H H H H H H H H H H H H H H H H H H
charge: 0
multiplicity: 1
keywords: wb97x-d3
keywords: def2-TZVPP
keywords: def2/J RIJCOSX
keywords: DEFGRID2
keywords: scfconv7
keywords: smallprint printgap noloewdin
keywords: NOSOSCF
formula: C25H20ClF2N3O3
InChI: InChI=1/C25H20ClF2N3O3/c26-18-10-8-17(9-11-18)23(16-6-7-16)31-34-14-15-4-12-19(13-5-15)29-25(33)30-24(32)22-20(27)2-1-3-21(22)28/h1-5,8-13,16,29-30H,6-7,14H2
54 atoms
Cl -5.316055 -0.475523 -5.72245
F  5.872932 -0.521044 -0.693406
F  6.27088 0.449279 3.865161
O  -4.405093 1.028033 0.34343
O  2.705243 2.533004 -0.3885
O  3.839832 -0.220598 2.487534
N  -4.377265 -0.193768 0.971996
N  1.861189 1.196568 1.26245
N  4.140665 1.26229 0.784848
C  -4.611681 -2.513788 0.780277
C  -5.483208 -3.616679 0.240924
C  -4.010259 -3.683547 0.045278
C  -4.595733 -1.167389 0.178106
C  -4.787769 -1.000655 -1.283065
C  -6.058153 -1.028697 -1.846937
C  -3.68227 -0.79758 -2.104102
C  -6.22854 -0.868146 -3.214447
C  -3.837872 -0.636968 -3.471278
C  -5.113715 -0.674596 -4.01348
C  -3.786949 2.008906 1.167038
C  -2.296196 1.847297 1.201683
C  -1.513944 2.284329 0.139151
C  -1.660274 1.199496 2.255409
C  0.488035 1.45963 1.183203
C  -0.13957 2.101078 0.1154
C  -0.290015 1.009283 2.250877
C  2.842857 1.716754 0.5042
C  6.013537 -0.010852 1.5862
C  4.562621 0.319443 1.670559
C  6.618652 -0.443703 0.41257
C  6.814778 0.029891 2.721803
C  7.944517 -0.815547 0.349151
C  8.148138 -0.317043 2.704223
C  8.703599 -0.743599 1.506929
H  -4.470655 -2.502534 1.854243
H  -6.103063 -3.414461 -0.622586
H  -5.939144 -4.269786 0.973201
H  -3.436711 -4.386504 0.634516
H  -3.622375 -3.511522 -0.950923
H  -6.928972 -1.173874 -1.220736
H  -2.687601 -0.767765 -1.677702
H  -7.220694 -0.892289 -3.643862
H  -2.973445 -0.482795 -4.102439
H  -4.062198 2.962607 0.714716
H  -4.208319 1.978876 2.175667
H  -1.981876 2.785595 -0.700053
H  -2.238698 0.841478 3.098062
H  0.416767 2.452312 -0.737592
H  0.182923 0.504448 3.085188
H  2.150822 0.571777 2.008236
H  4.838515 1.699057 0.195612
H  8.370616 -1.157376 -0.584049
H  8.738728 -0.255256 3.607821
H  9.746575 -1.026053 1.47678
elementType: Cl F O N C H
totalener: -2014.65219199 hartree
nucrepener: 3332.59118971 hartree
electener: -5347.24338170 hartree
oneelecener: -9385.28907184 hartree
twoeener: 4038.04569014 hartree
cpcmener: -0.04957108 hartree
kineticenergy: 2007.64421375 hartree
xcener: -167.130230550240 hartree
chargesum: -0.0000000
charge: -0.096631 -0.207886 -0.203121 -0.244742 -0.521975 -0.469696 -0.159493 -0.173017 -0.152368 -0.076315 -0.166347 -0.170839 0.231202 0.056026 -0.232308 -0.260879 -0.144426 -0.126049 0.086995 0.097563 -0.067764 -0.184299 -0.128221 0.194457 -0.206197 -0.226658 0.433196 -0.124431 0.410968 0.305827 0.301932 -0.238289 -0.240963 -0.066119 0.088643 0.098055 0.103139 0.101138 0.098762 0.159670 0.148467 0.146606 0.147328 0.113051 0.099175 0.144624 0.143112 0.156267 0.144209 0.203478 0.194868 0.155457 0.154595 0.170226
qa: -0.0966 -0.2079 -0.2031 -0.2447 -0.5220 -0.4697 -0.1595 -0.1730 -0.1524 -0.0763 -0.1663 -0.1708 0.2312 0.0560 -0.2323 -0.2609 -0.1444 -0.1260 0.0870 0.0976 -0.0678 -0.1843 -0.1282 0.1945 -0.2062 -0.2267 0.4332 -0.1244 0.4110 0.3058 0.3019 -0.2383 -0.2410 -0.0661 0.0886 0.0981 0.1031 0.1011 0.0988 0.1597 0.1485 0.1466 0.1473 0.1131 0.0992 0.1446 0.1431 0.1563 0.1442 0.2035 0.1949 0.1555 0.1546 0.1702
va: 1.2080 1.0868 1.0948 1.9178 1.9821 2.0380 2.9179 3.2530 3.2159 3.8632 3.8947 3.8884 3.7245 3.4606 4.0064 4.0064 3.9771 3.9587 3.8398 3.8394 3.6309 3.9820 3.9135 3.7804 3.9639 3.9884 4.3028 3.5459 4.0707 3.9290 3.9522 3.9556 3.9516 3.8099 1.0313 1.0156 1.0164 1.0173 1.0136 0.9990 1.0080 1.0042 1.0030 0.9950 1.0116 1.0058 1.0104 1.0264 1.0071 1.0347 1.0080 0.9995 1.0001 0.9835
dispcorr: -0.025823865 hartree
energy: -2014.678015859314
dipole: -24.37529 26.80672 2.43143 -8.80714 7.38203 -1.42511 9.85958 -9.12948 0.73010
magnitude: 2.91132 au
magnitude: 7.40000 debye
